{"text_format":"1","workbook":"xlsx","n_sheets":3,"sheets":["Antrag","Tabelle2","Schulliste 11.23"],"not_rendered":{"charts":0,"images":1,"macros":1,"external_links":0,"defined_names":2,"comments":0,"pivot_tables":0},"unopened":[],"bounds":{"document_bytes":16777216,"sheet_cells":100000,"rows_first":2000,"rows_last":500,"rows_between":2000,"halvings":0,"cell_chars":16384,"cell_head_chars":4096},"cells_cut":0,"cells_raw":0,"read":"whole","date_system":"1900"}

{"sheet":"Antrag","index":0,"n_rows":26,"n_cols":16,"rows_kept":26,"cut":false,"hidden":false,"merged":[[9,2,9,5],[10,2,10,5],[11,2,11,5],[12,2,12,5],[23,1,23,5],[25,1,25,5],[1,1,1,5],[15,1,18,1],[15,2,15,3],[16,2,16,3],[17,2,17,3],[18,2,18,3],[4,2,4,5],[5,2,5,5],[6,2,6,5],[7,2,7,5],[8,2,8,5],[20,2,20,5],[14,1,14,5],[21,3,21,5],[24,1,24,4]]}
[null,null,null,null,null,"GS Weyerbusch",null,null,"Plausi"]
[null,"Antrag auf Zuweisung einer Fremdsprachenassistenzkraft"]
[null,"für das Schuljahr ",null,"bitte auswählen …",null,null,null,null,{"$f":"IF(D3<>\"\",\"true\",\"false\")","v":"true"}]
[]
[null,"Schulnummer"]
[null,"Schulname",{"$f":"IFERROR(VLOOKUP(C5,'Schulliste 11.23'!$A$3:$G$1592,2,FALSE),\"\")","v":""}]
[null,"Straße, Nummer",{"$f":"IFERROR(VLOOKUP(C5,'Schulliste 11.23'!$A$3:$G$1592,3,FALSE),\"\")","v":""}]
[null,"PLZ",{"$f":"IFERROR(VLOOKUP(C5,'Schulliste 11.23'!$A$3:$G$1592,4,FALSE),\"\")","v":""}]
[null,"Ort",{"$f":"IFERROR(VLOOKUP(C5,'Schulliste 11.23'!$A$3:$G$1592,5,FALSE),\"\")","v":""}]
[null,"Telefon",{"$f":"IFERROR(VLOOKUP(C5,'Schulliste 11.23'!$A$3:$G$1592,6,FALSE),\"\")","v":""}]
[null,"E-Mail Schule",{"$f":"IFERROR(VLOOKUP(C5,'Schulliste 11.23'!$A$3:$G$1592,7,FALSE),\"\")","v":""}]
[null,"Kontaktperson/en",null,null,null,null,null,null,{"$f":"IF(C12<>\"\",\"true\",\"false\")","v":"false"}]
[null,"Email Kontaktperson/en",null,null,null,null,null,null,{"$f":"IF(C13<>\"\",\"true\",\"false\")","v":"false"}]
[]
[null,"Hiermit beantragen wir die Zuweisung einer Fremdsprachenassistenzkraft für das Fach: ",null,null,null,null,null,null,null,null,null,null,null,null,null,"rř"]
[null,"Bitte die \ngewünschte \nPriorität eingeben",null,null,"Englisch",null,null,null,{"$f":"IF(OR(C16<>\"Wählen Sie ein Element aus …\",C17<>\"Wählen Sie ein Element aus …\",C18<>\"Wählen Sie ein Element aus …\",C19<>\"Wählen Sie ein Element aus …\"),\"true\",\"false\")","v":"true"}]
[null,null,null,null,"Französisch"]
[null,null,null,null,"Spanisch"]
[null,null,null,null,"Italienisch"]
[null,"Bilingualer Zweig",null,"Englisch",null,"Französisch",null,null,"true"]
[null,"Bemerkungen\n(bitte ausfüllen)",null,null,null,null,null,null,{"$f":"IF(C21<>\"\",\"true\",\"false\")","v":"false"}]
[null,"Zustimmung",null,"Die Schulleitung hat dem Antrag auf Zuweisung einer FSA zugestimmt.",null,null,null,null,{"$f":"IF(C22=\"x\",\"true\",\"false\")","v":"false"}]
[null,{"$f":"IF(OR(I22=\"\",AND(I22=\"true\",I21=\"true\",I20=\"true\",I16=\"true\",I13=\"true\",I12=\"true\",I3=\"true\")),\"Daten vollständig\",\"Daten fehlen\")","v":"Daten fehlen"}]
[null,"Den Antrag bitte bis spätestens 31. Januar über den Button „Absenden“ abschließen."]
[]
[null,"Es wird automatisch eine Mail hierzu generiert. Warten Sie bitte, bis sich Outlook öffnet!"]

{"sheet":"Tabelle2","index":1,"n_rows":7,"n_cols":6,"rows_kept":7,"cut":false,"hidden":true,"merged":[]}
["Schuljahre",null,null,null,null,"GS Trier Ausonius"]
["bitte auswählen …"]
["2023/24",null,1]
["2024/25",null,2]
["2025/26",null,3]
["2026/27",null,4]
[null,null,"nein"]

{"sheet":"Schulliste 11.23","index":2,"n_rows":1592,"n_cols":10,"rows_kept":1592,"cut":false,"hidden":true,"merged":[]}
["SCHNR","KURZB","STRASSE","PLZ","ORT","TELEFON","EMAIL","ö/p","ADR1","ADR2"]
["bitte Schulnummer eintragen …"]
[10058,"GS Trier Ambrosius","Hans-Eiden-Platz 2",54292,"Trier","(0651)46394210","gs-ambrosius@arcor.de","ö","Ambrosius-Grundschule"]
[10075,"GS Trier Ausonius","Langstraße 4",54290,"Trier","(0651)718-4000","info@ausonius-grundschule.de","ö","Ausonius-Grundschule"]
[10091,"GS Linz","Schulstraße 10",53545,"Linz am Rhein","(02644)96000","sekretariat@grundschule-linz.de","ö","Bürgerm.-Castenholtz-Schule","Grundschule Linz"]
[10105,"GS Weyerbusch","Bgm.-Raiffeisen-Schule 11",57635,"Weyerbusch","(02686)295","grundschule@gs-weyerbusch.de","ö","Bürgerm.-Raiffeisen-Schule","Grundschule"]
[10118,"GS Frankenthal Carl-Bosch","Carl-Bosch-Ring 29",67227,"Frankenthal","(06233)26530","verwaltung@cbs-ft.bildung-rp.de","ö","Grundschule Carl Bosch"]
[10135,"GS Nackenheim","Pommardstraße 15",55299,"Nackenheim","(06135)9296.0","grundschule-nackenheim@vg-bodenheim.de","ö","Carl-Zuckmayer-Grundschule"]
[10148,"GS Mainz-Lerchenberg","Hindemithstr. 1",55127,"Mainz","(06131)364660","schule.gs-lerchenberg@stadt.mainz.de","ö","Grundschule Lerchenberg"]
[10181,"GS Weingarten","Schulstr. 12",67366,"Weingarten","(06344)2538","kontakt@grundschule-weingarten.de","ö","Ritter-von-Weingarten-Schule","Grundschule"]
[10238,"GS Worms Diesterweg","Nievergoltstr. 63",67549,"Worms","(06241)76044","diesterweg-gs@worms.de","ö","Diesterwegschule","Grundschule"]
[10255,"GS Newel","Trierer Straße 30",54309,"Newel","(06505)1743","gs-butzweiler@online.de","ö","Grundschule Aach-Newel"]
[10268,"GS Limburgerhof Domholz","Hermann-Löns-Weg 21",67117,"Limburgerhof","(06236)465552","domholzschule@gmx.de","ö","Grundschule Domholz"]
[10285,"GS Niederkirchen/Deidesheim","Im Kirchgarten 23",67150,"Niederkirchen","(06326)1377","sekretariat@don-bosco-schule-niederkirch","ö","Grundschule Niederkirchen"]
[10298,"GS Neustadt Albert-Finck","Horstweg 21",67434,"Neustadt","(06321)84795","gs-albert-finck@schulen.neustadt.eu","ö","Dr.-Albert-Finck-Schule","Grundschule"]
[10301,"GS Trier Egbert","Soterstraße 3",54295,"Trier","(0651)49251","post@egbert-grundschule.de","ö","Egbert-Grundschule"]
[10315,"GS Neustadt Eichendorff","Spitalbachstr. 45",67433,"Neustadt","(06321)186675","gs-eichendorff@schulen.neustadt.eu","ö","Eichendorff-Schule","Grundschule"]
[10328,"GS Bad Ems Ernst-Born","Arzbacher Str. 68",56130,"Bad Ems","(02603)12410","Ernst-Born-Schule@vgben.de","ö","Ernst-Born-Schule","Grundschule"]
[10331,"GS Haßloch Ernst-Reuter","Martin-Luther-Str. 25",67454,"Haßloch","(06324)935130","ernst-reuter-schule@hassloch.de","ö","Ernst-Reuter-Schule","Grundschule"]
[10388,"GS Bad Ems Freiherr-vom-Stein","Karl-Busch-Str. 1",56130,"Bad Ems","(02603)919510","Stein-Schule-Bad-Ems@gmx.de","ö","Grundschule Freiherr-vom-Stein"]
[10405,"GS Frankenthal Friedrich-Ebert","Jakobsplatz 3",67227,"Frankenthal","(06233)43099","gs-fes-frankenthal@gmx.de","ö","Friedrich-Ebert-Grundschule"]
[10421,"GS Trier Barbara","Friedrich-Wilhelm-Str. 52",54290,"Trier","(0651)49252","barbara-grundschule@web.de","ö","Barbara-Grundschule"]
[10435,"GS Hamm","Martin-Luther-Str. 4",57577,"Hamm","(02682)969422","gshamm@grundschule-hamm.de","ö","Friedrich-W.-Raiffeisen-Schule","Grundschule"]
[10451,"GS Gensingen","Schulstr. 4",55457,"Gensingen","(06727)8627","info@gsgensingen.de","ö","Grundschule Gensingen"]
[10465,"GS Neidenfels","Schulstraße 1",67468,"Neidenfels","(06325)8376","GGS.Neidenfels@t-online.de","ö","Gemeinsame Grundschule","Neidenfels und Frankeneck"]
[10478,"GS Ottersheim","Schulstraße 2",76879,"Ottersheim","(06348)7662","gsottersheim@gmail.com","ö","Grundschule","Ottersheim - Knittelsheim"]
[10481,"GS Sprendlingen","Schulstraße 44",55576,"Sprendlingen","(06701)1367","mail@grundschulesprendlingen.de","ö","Grundschule Sprendlingen"]
[10494,"GS Undenheim","Staatsrat-Schwamb-Straße 107",55278,"Undenheim","(06737)9627","info@grundschule-undenheim.de","ö","Grundschule","Am Goldbach"]
[10555,"GS Ilbesheim","Arzheimer Straße 75",76831,"Ilbesheim","(06341)32852","info@gs-ilbesheim.de","ö","Grundschule Kleine Kalmit"]
[10615,"GS Ingelheim Heidesheim","Kreuzstraße 47",55262,"Ingelheim am Rhein","(06132)50990","gs-heidesheim@ingelheim.de","ö","Grundschule an der Sandmühle","Heidesheim"]
[10631,"GS Ingelheim Pestalozzi","Carolinenstraße 7",55218,"Ingelheim am Rhein","(06132)73318","pestalozzischule@ingelheim.de","ö","Pestalozzi-Schule","Grundschule"]
[10645,"GS Lambsheim","Neustadter Straße 23",67245,"Lambsheim","(06233)346890","grundschule@karlwendelschule.de","ö","Karl-Wendel-Schule","Grundschule"]
[10658,"GS Maikammer","Schulstr. 3 - 5",67487,"Maikammer","(06321)952749","jls-maikammer@gmx.de","ö","Johannes-Leonhardt-Schule","Grundschule"]
[10718,"GS Waldsee","Schifferstadter Straße 2",67165,"Waldsee","(06236)54127","hgswaldsee@gmx.de","ö","Hermann-Gmeiner-Schule","Grundschule"]
[10764,"GS Neustadt August-Becker","Pestalozzistr. 4",67435,"Neustadt","(06327)3196","gs-august-becker@schulen.neustadt.eu","ö","August-Becker-Schule","Grundschule"]
[10794,"GS Mainz Ludwig-Schwamb","Schillstraße 4",55131,"Mainz","(06131)574862","schule.gs-ludwig-schwamb@stadt.mainz.de","ö","Ludwig-Schwamb-Schule","Grundschule"]
[10808,"GS Frankenthal Neumayer","Neumayerring 7",67227,"Frankenthal","(06233)298080","schulleiter@neumayer-grundschule.de","ö","Neumayer-Grundschule"]
[10825,"GS Idar-Oberstein Algenrodt","Weihergasse 20",55743,"Idar-Oberstein","(06781)64750","gs-algenrodt@idar-oberstein.de","ö","Grundschule","Algenrodt"]
[10838,"GS Braubach","Stiftstr. 1",56338,"Braubach","(02627)532","marksburgschule@t-online.de","ö","Marksburgschule","Grundschule"]
[10841,"GS Daleiden","Hauptstraße 5",54689,"Daleiden","(06550)746","info@gs-daleiden.de","ö","Pfarrer-Michael-Bormann-","Grundschule"]
[10868,"GS Dierdorf Gutenberg","Schulstraße 20",56269,"Dierdorf","(02689)3044","info@gbs-dierdorf.de","ö","Gutenberg-Schule","Grundschule"]
[10871,"GS Ediger-Eller","Paulusstr. 48",56814,"Ediger-Eller","(02675)343","gs-ediger-eller@gs-ediger-eller.bildung-","ö","Grundschule","Ediger-Eller"]
[10898,"GS Flomborn","Schulstraße 14",55234,"Flomborn","(06735)411","info@grundschule-flomborn.de","ö","Grundschule Flomborn"]
[10901,"GS Flonheim","Bahnhofstr. 5",55237,"Flonheim","(06734)91304-130","info@grundschule-flonheim.de","ö","Grundschule Flonheim"]
[10928,"GS Freudenburg","Leukstraße 18",54450,"Freudenburg","(06582)330","info@grundschule-freudenburg.de","ö","Grundschule Freudenburg"]
[10931,"GS Gau-Odernheim","Freiherr-vom-Stein-Str. 49",55239,"Gau-Odernheim","(06733)929676","info@gs-go.de","ö","Grundschule Gau-Odernheim"]
[10958,"GS Hagenbach","Am Stadtrand 1",76767,"Hagenbach","(07273)2520","hagenbach@gs.vg-hagenbach.de","ö","Hainbuchenschule","Grundschule"]
[10961,"GS Holzappel","Schulstraße 4",56379,"Holzappel","(06439)271","esterauschule@gmx.de","ö","Esterauschule","Grundschule"]
[10991,"GS Mainz Theodor-Heuss","Ringstraße 41b",55129,"Mainz","(06131)592056","schule.gs-hechtsheim@stadt.mainz.de","ö","Theodor-Heuss-Schule","Grundschule Mainz-Hechtsheim"]
[11019,"GS Münstermaifeld","Cusanusstr. 1",56294,"Münstermaifeld","(02605)2044","sekretariat.gs.mm@maifeld.de","ö","Cusanusschule"]
[11035,"GS Neustadt Mussbach","Schulstr. 12",67435,"Neustadt","(06321)69529","gs-mussbach@schulen.neustadt.eu","ö","Grundschule Mussbach"]
[11049,"GS Niederbrombach","Hauptstr. 2",55767,"Niederbrombach","(06787)981200","ghsniederbrombach@freenet.de","ö","Grundschule Niederbrombach"]
[11065,"GS Ochtendung","Raiffeisenplatz 5",56299,"Ochtendung","(02625)960156","gs.stmartin.oc@maifeld.de","ö","Grund- und Ganztagsschule","St.Martin"]
[11095,"GS Schönecken","An der Schule 1",54614,"Schönecken","(06553)92620","GHS-Schoenecken@t-online.de","ö","Graf-Hartard-Grundschule"]
[11112,"GS Neustadt Schöntal","Sauterstraße 95",67433,"Neustadt","(06321)487727","gs-schoentalschule@schulen.neustadt.eu","ö","Schöntalschule","Grundschule"]
[11139,"GS Mayen St. Veit","Koblenzer Str. 133",56727,"Mayen","(02651)947718","st.veitschule.my@t-online.de","ö","Grundschule St. Veit"]
[11155,"GS Trier Zewen","Fröbelstraße 7",54294,"Trier","(0651)85776","info@grundschule-zewen.de","ö","Grundschule Trier-Zewen"]
[11172,"GS Baumholder","Im Brühl 7",55774,"Baumholder","(06783)981130","schulleitung@grundschule-westrich-baumho","ö","Grundschule Baumholder","Westrich"]
[11259,"GS Mainz-Mombach-West","Am Lemmchen 48",55120,"Mainz","(06131)968154","schule.gs-amlemmchen@stadt.mainz.de","ö","Grundschule","Mombach-West"]
[11262,"GS Frankenthal Lessing","Gottfried-Keller-Str. 40",67227,"Frankenthal","(06233)64709","gs.lessingschule.ft@web.de","ö","Lessing-Schule","Grundschule"]
[11275,"GS Neustadt Ostschule","Konrad-Adenauer-Straße 33",67433,"Neustadt","(06321)189998-0","gs-ostschule@schulen.neustadt.eu","ö","Ostschule","Grundschule"]
[11289,"GS Neustadt Heinz-Sielmann","Ludwigstr. 30",67433,"Neustadt","(06321)937181","gs-heinz-sielmann-schule@schulen.neustad","ö","Heinz-Sielmann-Schule","Grundschule"]
[11292,"GS Ludwigshafen Blies","Krummlachstraße 10",67059,"Ludwigshafen am Rhein","(0621)504420710","info-gs@bliesschulen.de","ö","Bliesschule","Grundschule"]
[11305,"GS Idar-Oberstein Oberstein","Wüstenfeldstraße 50",55743,"Idar-Oberstein","(06781)64780","gs-oberstein@idar-oberstein.de","ö","Grundschule","Oberstein"]
[11319,"GS Haßloch Schiller","Schillerstr. 1a",67454,"Haßloch","(06324)935152","sonja.kammermayer@hassloch.de","ö","Schillerschule","Grundschule II"]
[11322,"GS Ludwigshafen Grimm","Hornstraße 1",67061,"Ludwigshafen am Rhein","(0621)504420910","info@gs-brueder-grimm.de","ö","Brüder-Grimm-Schule","Grundschule"]
[11335,"GS Mainz Feldberg","Feldbergplatz 4",55118,"Mainz","(06131)679901","schule.feldberg@stadt.mainz.de","ö","Feldbergschule","Grundschule"]
[11349,"GS Neuwied-Oberbieber","Veilchenstraße 5",56566,"Neuwied","(02631)47656","friedrich-ebert-schule@schulen-neuwied.d","ö","Friedrich-Ebert-Schule","Grundschule Oberbieber"]
[11352,"GS Kaiserslautern Geschwister-Scholl","Schreberstr. 37-39",67657,"Kaiserslautern","(0631)46109","gsgs-kl@web.de","ö","Geschwister-Scholl-Schule","Grundschule"]
[11365,"GS Ludwigshafen Goethe Nord","Goethestraße 19",67063,"Ludwigshafen am Rhein","(0621)504421510","info@goetheschule-nord.de","ö","Goetheschule Nord","Grundschule"]
[11379,"GS Mainz Goethe","Scheffelstr. 2",55118,"Mainz","(06131)612026","schule.gs-goethe@stadt.mainz.de","ö","Goetheschule","Grundschule"]
[11382,"GS Ludwigshafen Gräfenau","Gräfenaustraße 32",67063,"Ludwigshafen am Rhein","(0621)504421910","info@gsgraefenau.de","ö","Grundschule Gräfenau"]
[11395,"GS Ludwigshafen Kreuter","Am Brückelgraben 91",67071,"Ludwigshafen am Rhein","(0621)504-4225-1","info@kks-lu.de","ö","Karl-Kreuter-Schule","Grundschule"]
[11412,"GS Kaiserslautern Kotten","Kammgarnstr. 17",67659,"Kaiserslautern","(0631)78147","kottenschule@kaiserslautern.de","ö","Grundschule","Kottenschule"]
[11425,"GS Kaiserslautern Luitpold","Albrechtstr. 3",67655,"Kaiserslautern","(0631)69416","gs.luitpoldschule@kaiserslautern.de","ö","Luitpoldschule","Grundschule"]
[11439,"GS Ludwigshafen Luitpold","Luitpoldstraße 37",67063,"Ludwigshafen am Rhein","(0621)504422910","info@luitpoldschule.de","ö","Luitpold-Schule","Grundschule"]
[11442,"GS Mainz Maler-Becker","Schulstr. 7",55124,"Mainz","(06131)41720","schule.maler-becker@stadt.mainz.de","ö","Maler-Becker-Schule","Grundschule Gonsenheim"]
[11455,"GS Kaiserslautern Pestalozzi","Pfaffenbergstr. 108",67663,"Kaiserslautern","(0631)28637","pestalozzischule@kaiserslautern.de","ö","Pestalozzischule","Grundschule"]
[11469,"GS Ludwigshafen Oppau","Kurt-Schumacher-Straße 38",67069,"Ludwigshafen am Rhein","(0621)504421710","info@GS-Goethe-Mozart.de","ö","Goethe-Mozart-Schule","Grundschule Oppau"]
[11472,"GS Mainz Pestalozzi","Pestalozziplatz 6",55120,"Mainz","(06131)683410","schule.pestalozzi@stadt.mainz.de","ö","Pestalozzi-Schule","Grundschule Mombach"]
[11485,"GS Ingelheim Präsident Mohr","Schulstr. 12-14",55218,"Ingelheim am Rhein","(06132)75050","praesident-mohr-schule@ingelheim.de","ö","Präsident Mohr-Schule","Grundschule"]
[11498,"GS Kaiserslautern Röhm","Moltkestr. 27",67655,"Kaiserslautern","(0631)10833","gs-roehmschule@web.de","ö","Röhmschule","Grundschule"]
[11502,"GS Ludwigshafen Rupprecht","Nietzschestraße 30",67063,"Ludwigshafen am Rhein","(0621)504423710","info@gs-rupprechtschule.de","ö","Rupprechtschule","Grundschule"]
[11515,"GS Höhr-Grenzhausen","Schulstr. 9",56203,"Höhr-Grenzhausen","(02624)4749","goethe-schule@gs-hoehr-g.de","ö","Grundschule Goethe-Schule"]
[11529,"GS Kaiserslautern Schiller","Leipziger Straße 109",67663,"Kaiserslautern","0631-3654920","gs.schillerschule@kaiserslautern.de","ö","Schillerschule","Grundschule"]
[11532,"GS Ludwigshafen Oggersheim","Wormser Straße 17",67071,"Ludwigshafen am Rhein","(0621)504424110","info@gs-schiller.de","ö","Schillerschule 1","Grundschule"]
[11545,"GS Kaiserslautern Stiftswald","Stiftswaldstr. 54",67657,"Kaiserslautern","(0631)470111","gs.stiftswaldschule@kaiserslautern.de","ö","Stiftswaldschule","Grundschule"]
[11559,"GS Kaiserslautern Stresemann","Stresemannstr. 3",67663,"Kaiserslautern","(0631)59382","stresemannschule@kaiserslautern.de","ö","Stresemannschule","Grundschule"]
[11562,"GS Kaiserslautern Theodor-Heuss","Haspelstr. 37 - 39",67657,"Kaiserslautern","(0631)69229","gs-theodor-heuss-kl@gmx.de","ö","Theodor-Heuss-Schule","Grundschule"]
[11575,"GS Ludwigshafen Kästner","Bahnhofstraße 52",67059,"Ludwigshafen am Rhein","(0621)504421110","info@eks-lu.de","ö","Erich-Kästner-Schule","Grundschule"]
[11588,"GS Ludwigshafen Lessing","Bürgermeister-Fries-Straße 1c",67069,"Ludwigshafen am Rhein","(0621)504422710","info@gs-lessingschule.de","ö","Lessingschule","Grundschule"]
[11593,"GS Koblenz-Neuendorf","Handwerkerstraße 12-14",56070,"Koblenz","(0261)869757","schulleitung@gsneuendorf.bildung.koblenz","ö","Willi-Graf-Schule","Grundschule Neuendorf"]
[11605,"GS Ludwigshafen Wittelsbach","Wittelsbachstraße 73",67061,"Ludwigshafen am Rhein","(0621)504424510","info@gs-wittelsbachschule.de","ö","Grundschule Wittelsbach"]
[11619,"GS Mainz Münchfeld","Watfordstr. 30",55122,"Mainz","(06131)324723","schule.muenchfeld@stadt.mainz.de","ö","Grundschule Mainz-","Hartenberg-Münchfeld"]
[11622,"GS Kaiserslautern Betzenberg","Kantstr. 97",67663,"Kaiserslautern","(0631)10835","gs-betzenberg@web.de","ö","Grundschule Betzenberg"]
[11635,"GS Kaiserslautern Auf dem Fischerrück","Stettiner Str. 35",67659,"Kaiserslautern","(0631)3703283","gs.fischerrueck@kaiserslautern.de","ö","Grundschule","Auf dem Fischerrück"]
[11652,"GS Ludwigshafen Langgewann","Adolf-Kolping-Straße 30",67071,"Ludwigshafen am Rhein","(0621)504422310","info@langgewannschule.de","ö","Grundschule In der Langgewann"]
[11678,"GS Wasserliesch","In der Acht 4",54332,"Wasserliesch","(06501)13808","Grundschule-Wasserliesch@Konz.de","ö","Grundschule St. Marien"]
[11683,"GS Gau-Bickelheim","Pestalozzistr. 5",55599,"Gau-Bickelheim","(06701)2892","grundschule@gs-gaubickelheim.de","ö","Grundschule St. Martin"]
[11709,"GS Konz St. Nikolaus","Schlesierstraße 35",54329,"Konz","(06501)5744","GS.St.Nikolaus@Konz.de","ö","Grundschule St. Nikolaus"]
[11725,"GS Adenau","Schulstraße 18",53518,"Adenau","02691-546","info@grundschule-adenau.de","ö","Grundschule Adenau"]
[11739,"GS Ahrbrück","Kesselinger Straße 8",53506,"Ahrbrück","(02643)6774","gs-ahrbrueck@altenahr.de","ö","Denntal Grundschule Ahrbrück"]
[11742,"GS Ludwigshafen Schweitzer","Georg-Herwegh-Straße 9-11",67061,"Ludwigshafen am Rhein","(0621)504420110","sekretariat@asslu.de","ö","Albert-Schweitzer-Schule","Grundschule"]
[11755,"GS Zellertal","Zeller Straße 3",67308,"Zellertal","(06355)953930","gsz@zellertal-schule.de","ö","Zellertal-Schule","Grundschule"]
[11768,"GS Alf","Mühlenstraße 5",56859,"Alf","(06542)22374","schulealf@googlemail.com","ö","Grundschule Alf"]
[11786,"GS Ludwigshafen Delp","Schilfstraße 17",67067,"Ludwigshafen am Rhein","(0621)504420310","info@alfred-delp-gs.de","ö","Alfred-Delp-Schule","Grundschule"]
[11799,"GS Alpenrod","Schulstr. 8",57642,"Alpenrod","(02662)7790","schulleitung@grundschule-alpenrod.de","ö","Grundschule Alpenrod"]
[11802,"GS Alsdorf","Hauptstraße 53",57518,"Alsdorf","(02741)23134","hellertal@gsalsdorf.bildung-rp.de","ö","Grundschule Hellertal"]
[11815,"GS Trier-Heiligkreuz","Rotbachstraße 21",54295,"Trier","(0651)309872","post@grundschule-heiligkreuz.de","ö","Grundschule Heiligkreuz"]
[11829,"GS Rammelsbach","Schulstraße 2",66887,"Rammelsbach","(06381)3259","grundschule-rammelsbach@web.de","ö","Grundschule Rammelsbach"]
[11832,"GS Altenkirchen Pfalz","Schulstr. 12",66903,"Altenkirchen","(06386)6424","sekretariat.gsak@bildung.vgog.de","ö","Grundschule Altenkirchen"]
[11858,"GS Anhausen","Auf dem Löh 5",56584,"Anhausen","(02639)258","info@grundschule-anhausen.de","ö","Braunsburgschule","Grundschule"]
[11863,"GS Antweiler","Eichenbacher Weg 36",53533,"Antweiler","(02693)930016","mva-grundschule@gmx.de","ö","Margaretha-von-Arenberg-Schule","Grundschule"]
[11876,"GS Koblenz-Arenberg","Urbarer Straße 8",56077,"Koblenz","(0261)68367","schule@gsarenberg.bildung-rp.de","ö","Grundschule Arenberg"]
[11889,"GS Argenthal","Aulergasse 25",55496,"Argenthal","06761-1209808","info@grundschule-argenthal.de","ö","Grundschule am Waldsee","Argenthal"]
[11893,"GS Armsheim","Keltenweg 15",55288,"Armsheim","(06734)8728","info@gs-armsheim.de","ö","Wiesbachtalgrundschule"]
[11905,"GS Arzfeld","Schulstraße 10",54687,"Arzfeld","(06550)1275","info@gs-arzfeld.de","ö","Grundschule St. Christophorus"]
[11919,"GS Koblenz-Asterstein","Lehrhohl 42",56077,"Koblenz","(0261)74797","info@gsasterstein.bildung.koblenz.de","ö","Grundschule Asterstein"]
[11922,"GS Atzelgift-Streithausen","Schulstraße 20",57629,"Atzelgift","(02662)1333","GS.Atzelgift-Streithausen@rz-online.de","ö","Grundschule","Atzelgift-Streithausen"]
[11979,"GS Bad Bergzabern","Lessingstr. 38",76887,"Bad Bergzabern","(06343)989620","Sekretariat@boehaemmer-grundschule.de","ö","Böhämmer-Grundschule"]
[11996,"GS Bad Breisig","Rheintalstr. 35-39",53498,"Bad Breisig","(02633)9467","info@lindenschule-breisig.de","ö","Lindenschule","Grundschule"]
[12001,"GS Bad Dürkheim Pestalozzi","Schulplatz 1",67098,"Bad Dürkheim","(06322)980683","sekretariat.pesta@bad-duerkheim.de","ö","Pestalozzischule","Grundschule"]
[12014,"GS Bad Dürkheim-Grethen","Bürgermeister-Gropp-Str. 69",67098,"Bad Dürkheim","(06322)7414","sl.grethen@bad-duerkheim.de","ö","Grundschule Grethen"]
[12030,"GS Bad Kreuznach Winzenheim","Lindelstr. 10",55545,"Bad Kreuznach","0671/888091-2020","gs-winzenheim@bad-kreuznach.de","ö","Grundschule Winzenheim"]
[12044,"GS Bad Marienberg","Erlenweg 2",56470,"Bad Marienberg","(02661)914450","wolfsteinschule@t-online.de","ö","Wolfsteinschule","Grundschule"]
[12057,"GS Bad Münster","Ringstraße 23",55583,"Bad Kreuznach","0671-888091-2010","gs-bme@bad-kreuznach.de","ö","GS Bad Münster","a. Stein-Ebernburg"]
[12060,"GS Bad Neuenahr","Weststr. 27",53474,"Bad Neuenahr-Ahrweiler","(02641)28359","sekretariat@grundschule-bad-neuenahr.de","ö","Grundschule Bad Neuenahr"]
[12087,"GS Kaiserslautern Bännjerrück","Leipziger Str. 109",67663,"Kaiserslautern","(0631)3654930","gs.baennjerrueck@kaiserslautern.de","ö","GS Bännjerrück","Grundschule"]
[12117,"GS Bann","Schulstr. 7",66851,"Bann","(06371)3759","gsbann@vglandstuhl.de","ö","Don-Bosco-Grundschule","Grundschule Bann"]
[12134,"GS Bassenheim","Kettiger Weg 1",56220,"Bassenheim","(02625)4417","gsbassenheim@hotmail.com","ö","Grundschule Bassenheim"]
[12164,"GS Bechtheim","Am Markt 7",67595,"Bechtheim",null,null,"ö","Grundschule Bechtheim"]
[12177,"GS Bechtolsheim","Bahnhofstraße 11",55234,"Bechtolsheim","(06733)6829","info@gs-bechtolsheim.de","ö","Grundschule Bechtolsheim"]
[12180,"GS Bechhofen","Schulstr. 8",66894,"Bechhofen","(06372)8156","gs-bechhofen@vgzwland.de","ö","Grundschule Bechhofen"]
[12207,"GS Bellheim","Schulstr. 2",76756,"Bellheim","07272-7008600","grundschule@vg-bellheim.de","ö","Grundschule Bellheim"]
[12210,"GS Beltheim","Schulstraße 23",56290,"Beltheim","(06762)6990","info@gsbeltheim.de","ö","Adolf-Reichwein-Grundschule"]
[12224,"GS Berg/Pfalz","Kettelerstr. 7",76768,"Berg","07273-1391","berg@gs.vg-hagenbach.de","ö","Grundschule Berg"]
[12237,"GS Berg Vischeltal","Ahrstraße 87",53505,"Berg","(02643)1089","info@vischeltalschule.berg-aw.de","ö","Vischeltalschule","Grundschule"]
[12270,"GS Bernkastel-Kues","Schulstraße 2",54470,"Bernkastel-Kues","(06531)8132","cusanus-grundschule@t-online.de","ö","Cusanus-Grundschule"]
[12284,"GS Bernkastel-Wehlen","Hauptstr. 101",54470,"Bernkastel-Kues","(06531)8851","schule@gswehlen.bildung-rp.de","ö","Grundschule Wehlen"]
[12300,"GS Beuren","Schulstr. 4",54413,"Beuren","(06586)292","gsbeuren@web.de","ö","Grundschule Beuren"]
[12344,"GS Bingen-Bingerbrück","Herterstr. 35",55411,"Bingen am Rhein","(06721)32233","info@gs-am-maeuseturm.de","ö","Grundschule am Mäuseturm"]
[12357,"GS Bingen-Büdesheim","Pestalozzistraße 1",55411,"Bingen am Rhein","(06721)497810","info@grundschule-buedesheim.de","ö","Grundschule am Entenbach"]
[12360,"GS Bingen-Dietersheim","Pommernstr. 4",55411,"Bingen am Rhein","(06721)44643","info@grundschule-dietersheim.de","ö","Grundschule Dietersheim"]
[12374,"GS Bingen-Dromersheim","Marienstr. 1",55411,"Bingen am Rhein","(06725)2444","verwaltung@grundschule-dromersheim.de","ö","Grundschule am Hörnchen"]
[12387,"GS Bingen-Gaulsheim","Mainzer Straße 435",55411,"Bingen am Rhein","(06721)12392","schulleitung@grundschule-gaulsheim.de","ö","Grundschule an den Rheinwiesen","Grundschule Bingen-Gaulsheim"]
[12390,"GS Bingen-Kempten","Gaulsheimer Weg 16-18",55411,"Bingen am Rhein","(06721)12509","info@dreikoenigsschule-kempten.de","ö","Drei-Königs-Schule","Grundschule Kempten"]
[12417,"GS Bingen-Stadt","Franz-Burkard-Str. 2-6",55411,"Bingen am Rhein","(06721)916911","sekretariat@gs-bingen.de","ö","Grundschule an der Burg Klopp"]
[12420,"GS Birkenfeld","An den Gerbhäusern 3",55765,"Birkenfeld","(06782)99580","gs_birkenfeld@web.de","ö","Grundschule Birkenfeld"]
[12434,"GS Birkenheide","Waldstraße 27",67134,"Birkenheide","(06237)7874","gs.birkenheide@vg-maxdorf.de","ö","Albertine-Scherer-Schule","Grundschule"]
[12450,"GS Waldgrehweiler","Felsenstraße 6",67822,"Waldgrehweiler","(06364)1805","GS-Waldgrehweiler@t-online.de","ö","Grundschule Waldgrehweiler"]
[12464,"GS Bitburg-Nord","Theobald-Simon-Str. 10",54634,"Bitburg","(06561)97106-0","grundschule-nord@bitburg.de","ö","Grundschule Bitburg-Nord"]
[12477,"GS Bitburg-Süd","Borenweg 9",54634,"Bitburg","(06561)693890","grundschule-sued@bitburg.de","ö","Grundschule Bitburg-Süd"]
[12493,"GS Bleialf","Im Gäßchen 6",54608,"Bleialf","(06555)90093-0","gsbleialf@gmx.de","ö","Grundschule Bleialf"]
[12507,"GS Bobenheim-Roxheim Rhein","Rheinstraße 32",67240,"Bobenheim-Roxheim","(06239)99640","rheinschule@bobenheim-roxheim.de","ö","Rheinschule","Grundschule"]
[12510,"GS Bodenheim","Kirchbergstr. 12",55294,"Bodenheim","(06135)932603","grundschule-bodenheim@vg-bodenheim.de","ö","Grundschule Bodenheim"]
[12524,"GS Böhl","Kirchenstr. 12",67459,"Böhl-Iggelheim","(06324)921903","gsboehl@boehl-iggelheim.de","ö","Johannes-Fink-Grundschule"]
[12540,"GS Bolanden-Dannenfels","Im Goschental 5",67295,"Bolanden","(06352)5079","sekretariat@grundschule-bolanden-dannenf","ö","Grundschule","Bolanden-Dannenfels"]
[12554,"GS Bollendorf","Sauerstaden 0",54669,"Bollendorf","(06526)443","info@gs-bollendorf.de","ö","Grundschule Bollendorf"]
[12567,"GS Boos","Schulstr. 21",56729,"Boos","(02656)1439","schulleitung@gsboos.bildung-rp.de","ö","Grundschule Boos"]
[12570,"GS Boppard Michael Thonet","Auf der Zeil 20",56154,"Boppard","(06742)4003","kontakt@michael-thonet-schule.de","ö","Michael-Thonet-Schule","Grundschule"]
[12583,"GS Borod","Schulstr. 12",57614,"Borod","(02688)287","info@grundschule-borod.de","ö","Grundschule Borod"]
[12597,"GS Breitenbach","Auf dem Wilcher 9",66916,"Breitenbach","(06386)5096","sl.gsbb@bildung.vgog.de","ö","Grundschule Breitenbach"]
[12614,"GS Bretzenheim","Stephanskapellenweg 6",55559,"Bretzenheim","(0671)31917","gs-bretzenheim@web.de","ö","Grundschule Bretzenheim"]
[12627,"GS Pünderich","Bahnhofstr. 2",56862,"Pünderich","06542-21080","gs-puenderich@myquix.de","ö","Grundschule Briedel-Pünderich"]
[12630,"GS Brohl-Lützing","Quellenstr. 15",56656,"Brohl-Lützing","(02633)1581","Leo-Stausberg-Schule@t-online.de","ö","Leo-Stausberg-Schule","Grundschule"]
[12644,"GS Miesau","Raiffeisenstraße 4a",66892,"Bruchmühlbach-Miesau","(06372)619470","schulleitung@gs-miesau.Bildung-rp.de","ö","Grundschule Miesau"]
[12657,"GS Bruchmühlbach-Martinshöhe","Alte Straße 3",66892,"Bruchmühlbach-Miesau","(06372)3591","mail@gs-bm.de","ö","Grundschule Bruchmühlbach-","Martinshöhe"]
[12660,"GS Brücken/Pfalz","Wiesenstraße 25",66904,"Brücken","(06386)6410","sekretariat.gsbr@bildung.vgog.de","ö","Grundschule Brücken/Pfalz"]
[12687,"GS Buchholz/Ww.","Auf dem Otenbruch 1",53567,"Buchholz","(02683)6419","info@grundschulebuchholz.de","ö","Grundschule Buchholz/WW"]
[12690,"GS Büchel","Schulstraße 6",56823,"Büchel","(02678)228","sekretariat@grundschule-buechel.de","ö","Grundschule Büchel"]
[12704,"GS Wörth Büchelberg","Turmstr. 2",76744,"Wörth am Rhein","(07271)131-260","gs-buechelberg@woerth.de","ö","Grundschule Büchelberg"]
[12717,"GS Büchenbeuren","In den Fichten 2",55491,"Büchenbeuren","(06543)6081","gsbuech@t-online.de","ö","Grundschule Büchenbeuren"]
[12720,"GS Birresborn","Neustraße 7",54574,"Birresborn","(06594)397","schulleitung@gs-birresborn.de","ö","Grundschule Birresborn"]
[12747,"GS Bullay","Lindenplatz 4",56859,"Bullay","(06542)22020","gbullay@rz-online.de","ö","Grundschule Bullay"]
[12763,"GS Burbach","Schulstr. 56",54597,"Burbach","(06553)2800","info@gs-burbach.de","ö","Grundschule Burbach"]
[12780,"GS Mayen Clemens","Habsburgring 2",56727,"Mayen","(02651)903031","mail@grundschuleclemens.de","ö","Grundschule Clemens"]
[12793,"GS Cochem","Jahnstraße 21",56812,"Cochem","(02671)97640","grundschulecochem@gs-cochem.bildung-rp.d","ö","Grundschule Cochem"]
[12807,"GS Contwig","Felsackerstr. 9",66497,"Contwig","(06336)328","gs-contwig@vgzwland.de","ö","Grundschule Contwig"]
[12810,"GS Daaden Daadetal","Hachenburger Straße 7",57567,"Daaden","(02743)2288","info@daadetal-grundschule.de","ö","Grundschule Daaden","Daadetal-Grundschule"]
[12824,"GS Daaden-Biersdorf","Friedhofstr. 6",57567,"Daaden","(02743)2239","info@gs-biersdorf.de","ö","Grundschule Biersdorf"]
[12837,"GS Dachsenhausen","Schulstr. 14",56340,"Dachsenhausen","(06776)580","gsdachsenhausen.rlp@online.de","ö","Grundschule Dachsenhausen"]
[12853,"GS Daun","Freiherr-vom-Stein-Str. 3",54550,"Daun","(06592)2305","info@grundschule-daun.de","ö","Grundschule Daun"]
[12867,"GS Dausenau","Langgasse 67",56132,"Dausenau","(02603)6512","gs.dausenau@gmx.de","ö","Grundschule Dausenau","Grundschule an der Ringmauer"]
[12870,"GS Deidesheim","Heumarktstraße 8",67146,"Deidesheim","(06326)8288","info@grundschule-deidesheim.de","ö","Grundschule Deidesheim"]
[12930,"GS Dienheim","Siliusstr. 4",55276,"Dienheim","(06133)4412","info@falkenberg-grundschule.de","ö","Falkenberg-Grundschule","Grundschule"]
[12943,"GS Dittelsheim-Heßloch","Kämmerergasse 12",67596,"Dittelsheim-Heßloch","(06244)4510","gutzler@vondalbergschule.bildung-rp.de","ö","Von-Dalberg-Schule","Grundschule"]
[12957,"GS Dockweiler","Schulstr. 6",54552,"Dockweiler","(06595)668","gs.dockweiler@vgdaun.de","ö","Grundschule Dockweiler"]
[13021,"GS Ebertsheim","Rodenbacher Straße 4",67280,"Ebertsheim","(06359)3764","gs-ebertsheim@gmx.de","ö","Grundschule Ebertsheim"]
[13048,"GS Edenkoben","Weinstraße 132",67480,"Edenkoben","(06323)9868-235","sekretariat@gs-edenkoben.de","ö","Grundschule Edenkoben"]
[13051,"GS Andernach-Eich","Schulstraße 8",56626,"Andernach","(02632)82871","gseich@web.de","ö","Grundschule Eich"]
[13078,"GS Elkenroth","Jahnstraße 1",57578,"Elkenroth","(02747)91570","info@grundschule-elkenroth.de","ö","St.-Martin-Schule","Grundschule"]
[13081,"GS Ellerstadt","Bahnstraße 92",67158,"Ellerstadt","(06237)3180","ellerstadt@grundschule-efg.bildung-rp.de","ö","Grundschule Ellerstadt","Friedelsheim-Gönnheim"]
[13094,"GS Enkenbach-Alsenborn","Am Pulverhäuschen 2",67677,"Enkenbach-Alsenborn","(06303)913460","schulleitung@gs-enkenbach-alsenborn.bild","ö","Josef-Guggenmos-Grundschule"]
[13108,"GS Enkirch","Am Wochenmarkt 15",56850,"Enkirch","(06541)6776","gsenkirch@gmx.de","ö","Freiherrn von Wiltberg Schule","Grundschule"]
[13138,"GS Ludwigshafen Reuter","Schlesierstraße 56",67065,"Ludwigshafen am Rhein","(0621)504421310","info@gs.erslu.de","ö","Ernst-Reuter-Grundschule","Grundschule"]
[13141,"GS Erpel","Winzerstr. 8",53579,"Erpel","(02644)3355","Grundschule.Erpel@web.de","ö","St. Johannes-Grundschule"]
[13168,"GS Essenheim","Münchhofpforte 20",55270,"Essenheim","(06136)8323","schule@gs-essenheim.de","ö","Grundschule Essenheim"]
[13171,"GS Essingen","Am Turnplatz 14",76879,"Essingen","(06347)8468","sekretariat@grundschule-essingen.de","ö","Grundschule Essingen"]
[13198,"GS Esthal","Hauptstraße 63",67472,"Esthal","(06325)8674","grundschule-esthal@gmx.de","ö","Grundschule Esthal"]
[13201,"GS Etzbach","Wiesenstr. 21",57539,"Etzbach","(02682)573","info@grundschule-etzbach.de","ö","Grundschule Etzbach"]
[13214,"GS Fachbach","Koblenzer Str. 50a",56133,"Fachbach","(02603)13310","gs.fachbach@gmx.de","ö","Grundschule Fachbach"]
[13228,"GS Farschweiler","Kuhbach 16",54317,"Farschweiler","(06500)293","grundschule@farschweiler.de","ö","Grundschule Farschweiler"]
[13244,"GS Feilbingert","Fröbelstr. 1",67824,"Feilbingert","06708-1730","GS-Feilbingert@localhost","ö","Grundschule Feilbingert"]
[13261,"GS Flammersfeld","Südstraße 2",57632,"Flammersfeld","(02685)466","gs-flammersfeld@gmx.de","ö","Raiffeisen-Grundschule","Flammersfeld"]
[13288,"GS Frankenthal-Eppstein-Flomersheim","Falterstr. 12",67227,"Frankenthal","(06233)54095","info@gs-eppstein-flomersheim.de","ö","Grundschule Eppstein-","Flomersheim"]
[13304,"GS Frankenthal-Mörsch","Hauptstr. 14",67227,"Frankenthal","(06233)61439","gsmoersch@gmx.de","ö","Grundschule Mörsch"]
[13318,"GS Frankenthal-Studernheim","Frankenthaler Str. 1",67227,"Frankenthal","(06233)40711","Grundschule-Studernheim@web.de","ö","Grundschule Studernheim"]
[13334,"GS Freckenfeld","Raiffeisenstr. 6",76872,"Freckenfeld","(06340)8655","GS-Freckenfeld@t-online.de","ö","Grundschule Freckenfeld"]
[13348,"GS Koblenz Freiherr-vom-Stein","Steinstraße 20",56073,"Koblenz","(0261)42168","sekretariat@gsfreiherrvomsteins.bildung.","ö","Grundschule Freiherr-vom-Stein"]
[13351,"GS Frei-Laubersheim","Schulstraße 1",55546,"Frei-Laubersheim","(06709)555","grundschulefl@googlemail.com","ö","Grundschule Frei-Laubersheim"]
[13364,"GS Friedewald","Kaiser-Ludwig-Straße 2",57520,"Friedewald","(02743)1250","info@grundschule-friedewald.de","ö","Grundschule Friedewald"]
[13378,"GS Fürfeld","Schulstr. 1",55546,"Fürfeld","(06709)318","Grundschule@fuerfeld.de","ö","Grundschule Fürfeld"]
[13381,"GS Gau-Algesheim","Schlossgasse 14",55435,"Gau-Algesheim","(06725)6146","sekretariat@gs-gau-algesheim.de","ö","Schloß-Ardeck-Schule","Grundschule"]
[13394,"GS Gau-Bischofsheim","Schulstraße 12",55296,"Gau-Bischofsheim","(06135)951420","grundschule-gau-bischofsheim@vg-bodenhei","ö","Astrid-Lindgren-Grundschule"]
[13408,"GS Gebhardshain","Schulstraße 2a",57580,"Gebhardshain","(02747)3550","info@grundschule-gebhardshain.de","ö","Astrid-Lindgren-Schule","Grundschule"]
[13411,"GS Gemünden/Westerwald","Hauptstr. 38",56459,"Gemünden","(02663)4336","info@gs-gemuenden.de","ö","Grundschule Gemünden/WW"]
[13438,"GS Germersheim Eduard-Orth","Zeppelinstr. 11",76726,"Germersheim",4.9727450075E+21,"sekretariat@eduard-orth-grundschule.de","ö","Grundschule Germersheim","Dr. Eduard-Orth-Schule"]
[13441,"GS Germersheim Gottfried Tulla","Schulstr. 3",76726,"Germersheim","(07274)70250","tullaschule@gmx.de","ö","Gottfried-Tulla-Schule","Grundschule"]
[13468,"GS Pirmasens-Windsberg/Winzeln","Oskar-Metz-Straße 1",66954,"Pirmasens","(06331)98284","gs.gww@pirmasens.de","ö","Grundschule Pirmasens","Gersbach/Windsberg/Winzeln"]
[13497,"GS Gleiszellen-Gleishorbach","Schulstr. 1",76889,"Gleiszellen-Gleishorbach","(06343)1248","Horbach-Grundschule@t-online.de","ö","Horbach-Grundschule","Gleiszellen-Gleishorbach"]
[13501,"GS Gödenroth","Schulstr. 4",56290,"Gödenroth","(06762)6696","schule@welleg.de","ö","Grundschule Gödenroth"]
[13514,"GS Idar-Oberstein Göttschied","Eichenwaldstraße 1",55743,"Idar-Oberstein","(06781)64760und6","gs-goettschied@idar-oberstein.de","ö","Grundschule","Göttschied"]
[13531,"GS Gondershausen","Schulstraße 41",56283,"Gondershausen","(06745)9233","schulleitung@gsgondershausen.de","ö","Grundschule Gondershausen"]
[13544,"GS Greimerath","Schulstr. 15",54314,"Greimerath","(06587)7231","gs-greimerath@freenet.de","ö","Grundschule Greimerath"]
[13558,"GS Großlittgen","Schladter Straße 45",54534,"Großlittgen","(06575)4738","schulleitung@grundschule-grosslittgen.de","ö","Grundschule Großlittgen"]
[13561,"GS Großmaischeid","Schulstr. 2",56276,"Großmaischeid","02689-5390","info@hgs-maischeid.de","ö","Hermann-Gmeiner-Schule","Grundschule"]
[13574,"GS Großniedesheim","Kleinniedesheimer Straße 2",67259,"Großniedesheim","(06239)1360","info@gs-grossniedesheim.de","ö","Grundschule Großniedesheim"]
[13604,"GS Guldental","Dammweg 13",55452,"Guldental","(06707)608","info@grundschule-guldental.de","ö","Grundschule Guldental"]
[13618,"GS Gundersheim","Am Schulberg 2",67598,"Gundersheim","(06244)5285","grundschule-gundersheim@vg-wonnegau.de","ö","Grundschule Gundersheim"]
[13621,"GS Guntersblum","Götzenstraße 19",67583,"Guntersblum","(06249)906400","schulleitung@carl-kuestner-grundschule.d","ö","Carl-Küstner-Schule","Grundschule"]
[13634,"GS Gusenburg","Mühlenweg 1",54413,"Gusenburg","(06503)7747","verwaltung@gsgusenburg.de","ö","Grundschule Gusenburg"]
[13651,"GS Morbach-Haag","Flurstraße 26",54497,"Morbach","(06533)3184","gs-haag-merscheid@freenet.de","ö","Grundschule Haag-Merscheid"]
[13664,"GS Hachenburg Schloss","Leipziger Str. 8",57627,"Hachenburg","(02662)6764","info@gs-hachenburg.de","ö","Grundschule am Schloss"]
[13677,"GS Hachenburg-Altstadt","Obere Kirchstraße 1",57627,"Hachenburg","(02662)1555","Grundschule-Altstadt@t-online.de","ö","Grundschule Hachenburg-","Altstadt"]
[13681,"GS Hackenheim","Hauptstraße 30",55546,"Hackenheim","(0671)69709","gshackenheim@web.de","ö","Grundschule Hackenheim"]
[13711,"GS Hanhofen","Schulstraße 3",67374,"Hanhofen","(06344)4780","gshanhofen@schulpt.de","ö","Grundschule Hanhofen"]
[13724,"GS Halsenbach","Hauptstr. 6",56283,"Halsenbach","(06747)6391","schulleitung@gshalsenbach.de","ö","Grundschule Halsenbach"]
[13741,"GS Hargesheim","Schulstr. 33",55595,"Hargesheim","(0671)32617","grundschule.hargesheim@t-online.de","ö","Grundschule Hargesheim"]
[13754,"GS Hasborn","Am Bahnhof 1",54533,"Hasborn","(06574)204","schulleitung@grundschule-hasborn.de","ö","Grundschule am Eichenhain","Hasborn"]
[13767,"GS Hauenstein","Marienstr. 10",76846,"Hauenstein","(06392)4096290","grundschule.hauenstein@web.de","ö","Grundschule Hauenstein"]
[13771,"GS Hauptstuhl","Schulstr. 9",66851,"Hauptstuhl","(06372)4603","gshauptstuhl@vglandstuhl.de","ö","Rotbach-Grundschule Hauptstuhl"]
[13801,"GS Heidenburg","Schulstr. 5",54426,"Heidenburg","(06509)262","info@gs-heidenburg.de","ö","Grundschule Heidenburg"]
[13814,"GS Heimbach","In der Au 28",55779,"Heimbach","(06789)294","leitung@grundschule-heimbach.de","ö","Grundschule Heimbach"]
[13828,"GS Hellenhahn-Schellenberg","Schulstraße 9",56479,"Hellenhahn-Schellenberg","(02664)6763","Schellenberg-Schule@gmx.de","ö","Schellenberg-Schule","Grundschule"]
[13844,"GS Herdorf","Homscheidstraße 18",57562,"Herdorf","(02744)1693","Grundschule-Herdorf@t-online.de","ö","Maria-Homscheid-Grundschule","Herdorf"]
[13861,"GS Hermeskeil","Schulstr. 19",54411,"Hermeskeil","(06503)7038","verwaltung@gshermeskeil.de","ö","Grundschule Hermeskeil"]
[13887,"GS Herresbach","Schulstraße 6",56729,"Herresbach","(02656)950157","gs-herresbach@herresbach.net","ö","Grundschule Herresbach"]
[13891,"GS Herschbach/Oww.","Schulstr. 8",56414,"Herschbach","(06435)2780","astrid-lindgren-gs-herschbach@gmx.de","ö","Astrid-Lindgren-Schule","Grundschule Herschbach/Oww."]
[13904,"GS Herxheim","Kolpingstr. 1",76863,"Herxheim bei Landau/ Pfalz","(07276)501-501","sekretariat@gs-herxheim.bildung-rp.de","ö","Grundschule Herxheim"]
[13918,"GS Hillesheim","Lammersdorfer Str. 18a",54576,"Hillesheim","(06593)9429","schule@grundschule-hillesheim.de","ö","Grundschule Hillesheim"]
[13921,"GS Mayen Hinter Burg","Einsteinstraße 3-5",56727,"Mayen","(02651)903041","schule@gshinterburg.de","ö","Grundschule Hinter Burg"]
[13934,"GS Hinterweidenthal","Schulstr. 7",66999,"Hinterweidenthal","(06396)271","gshinterweidenthal@gmx.de","ö","Grundschule Hinterweidenthal"]
[13947,"GS Hochdorf-Assenheim","Alfons-Legner-Straße 5-7",67126,"Hochdorf-Assenheim","06231-1390","info@gs-hochdorf.de","ö","Grundschule","Hochdorf-Assenheim"]
[13951,"GS Ludwigshafen Hochfeld","Leistadter Straße 45",67067,"Ludwigshafen am Rhein","(0621)504422110","info@gshochfeld-lu.de","ö","Grundschule Hochfeld","Schwerpunktschule"]
[13964,"GS Hochspeyer","Kreuzhohlstr. 2",67691,"Hochspeyer","0630-1801","schulleitung@muenchhofschule.de","ö","Münchhofschule-Grundschule"]
[13981,"GS Birken-Honigsessen","Hauptstraße 134",57587,"Birken-Honigsessen","(02742)969100","schule@biho.bildung-rp.de","ö","Christophorus-Grundschule","Grundschule Birken-Honigsessen"]
[14012,"GS Pirmasens Horeb","Herzogstr. 41",66953,"Pirmasens","(06331)24030","gs.horeb@pirmasens.de","ö","Horebschule","Grundschule"]
[14025,"GS Horhausen","Steinstr. 3",56593,"Horhausen","(02687)929183","info@grundschule-horhausen.de","ö","Glück auf!-Schule","Grundschule"]
[14038,"GS Landau Thomas-Nast","Albrecht-Dürer-Str. 3",76829,"Landau in der Pfalz","(06341)134492","tngs@landau.de","ö","Thomas-Nast-Schule","Grundschule"]
[14042,"GS Landau Horstring","Helmbachstr. 100",76829,"Landau in der Pfalz","06341-134411","horstringschule@landau.de","ö","Grundschule Horstring"]
[14055,"GS Harthausen","Schulstraße 1",67376,"Harthausen","(06344)8695","karl-hufnagel-schule@web.de","ö","Karl-Hufnagel-Schule","Grundschule"]
[14068,"GS Hütschenhausen","Schulstraße 3",66882,"Hütschenhausen","(06371)3489","info@gs-huetschenhausen.de","ö","Grundschule Hütschenhausen"]
[14086,"GS Hupperath","Schulstr. 16",54518,"Hupperath","(06571)7677","schulleitung@gshupperath.de","ö","Grundschule Hupperath"]
[14099,"GS Pirmasens-Husterhöhe","Husterhöhstr. 25",66953,"Pirmasens","(06331)517210","gs.husterhoehe@pirmasens.de","ö","Grundschule Husterhöhe"]
[14102,"GS Altenkirchen I","Ziegelweg 4",57610,"Altenkirchen","(02681)6136","info@pestalozzi-ak.de","ö","Pestalozzi-Schule","Grundschule I"]
[14115,"GS Grünstadt Theodor-Heuss","Langgasse 74",67269,"Grünstadt","(06359)960242","info@ths-asselheim.de","ö","Grundschule I Grünstadt","Theodor-Heuss-Schule"]
[14132,"GS Idesheim","Schulstr. 12",54636,"Idesheim","(06506)991036","info@gs-idesheim.de","ö","Grundschule Idesheim"]
[14145,"GS Igel","Auf der Weisley 2",54298,"Igel","(06501)12985","gs-igel@online.de","ö","Grundschule Igel"]
[14158,"GS Iggelheim","Langgasse 10",67459,"Böhl-Iggelheim","(06324)969910","gsiggelheim@boehl-iggelheim.de","ö","Jakob-Heinrich-Lützel-Schule","Grundschule Iggelheim"]
[14163,"GS Grünstadt Dekan-Ernst","Südring 7",67269,"Grünstadt","(06359)937730","info@dekan-ernst-schule.de","ö","Dekan-Ernst-Schule","Ganztagsschule in Angebotsform"]
[14176,"GS Altenkirchen II","Siegener Str. 26",57610,"Altenkirchen","(02681)6148","lo@eks-altenkirchen.de","ö","Erich-Kästner-Schule","Grundschule II"]
[14218,"GS Imsweiler","Alsenzstraße 12",67808,"Imsweiler","(06361)1057","paula-best-grundschule@vg-rok.de","ö","Paula-Best Grundschule","Imsweiler"]
[14222,"GS Ingelheim-Nord","Brüder-Grimm-Str. 27",55218,"Ingelheim am Rhein",null,null,"ö","Brüder-Grimm-Schule","Grundschule Ingelheim-Nord"]
[14235,"GS Irsch","Schulstraße 1",54451,"Irsch","(06581)2944","grundschule.irsch@aol.de","ö","Grundschule Irsch/Saar"]
[14266,"GS Buchholz-Jungeroth","Hennefer Str. 48",53567,"Buchholz","(02248)4253","info@gs-jungeroth.de","ö","Grundschule Jungeroth"]
[14296,"GS Kaiserslautern-Hohenecken","Forststr. 2",67661,"Kaiserslautern","(0631)3503883","gs.hohenecken@kaiserslautern.de","ö","Grundschule Hohenecken"]
[14308,"GS Kaiserslautern-Erfenbach","Siegelbacher Straße 108",67659,"Kaiserslautern","(06301)8122","gs.pfaffenwoog@kaiserslautern.de","ö","Grundschule Pfaffenwoog","in Kaiserslautern-Erfenbach"]
[14312,"GS Kaiserslautern-Dansenberg","Wasserlochstücke 7a",67661,"Kaiserslautern","(0631)52593","GSDansenberg@web.de","ö","Grundschule Dansenberg"]
[14325,"GS Kaiserslautern-Erzhütten","Erzhütter Straße 101",67659,"Kaiserslautern","(0631)4147495","gs.erzhuetten@kaiserslautern.de","ö","Grundschule Erzhütten"]
[14338,"GS Kaiserslautern-Morlautern","Otterberger Straße 47",67659,"Kaiserslautern","(0631)77379","gs.morlautern@gmx.de","ö","Grundschule Morlautern"]
[14343,"GS Kaiserslautern-Erlenbach","Erlenbacher Str. 24",67659,"Kaiserslautern","(06301)8088","gs.erlenbach@kaiserslautern.de","ö","Grundschule Erlenbach"]
[14356,"GS Kamp-Bornhofen","Marienstraße 18",56341,"Kamp-Bornhofen","(06773)1233","GSKAMP-BORNHOFEN@t-online.de","ö","Grundschule Kamp-Bornhofen"]
[14369,"GS Kandel Ludwig-Riedinger","Marktstr. 6",76870,"Kandel","(07275)918249","info@grundschule-kandel.de","ö","Ludwig Riedinger Grundschule"]
[14399,"GS Karlshausen","Auf dem Garten 6",54673,"Karlshausen","(06564)2213","gs-karlshausen@gmx.de","ö","Grundschule Karlshausen"]
[14415,"GS Kastellaun","Pestalozzistr. 14",56288,"Kastellaun","(06762)961857","info@gskastellaun.de und schulleitung@gs","ö","Grundschule Kastellaun"]
[14428,"GS Katzwinkel","Knappenstraße 55a",57581,"Katzwinkel","(02741)8812","schulleitung@bgskw.de","ö","Barbaraschule","Grundschule Katzwinkel"]
[14446,"GS Kehrig","Polcher Str. 8",56729,"Kehrig","(02651)5133","gskehrig@web.de","ö","Grundschule Kehrig"]
[14476,"GS Kempenich","Hardtstr. 2",56746,"Kempenich","(02655)1595","gskempenich@brohltal-schulen.de","ö","Grundschule Kempenich"]
[14489,"GS Kenn","Gartenstraße 13",54344,"Kenn","(06502)8419","info@gs-kenn.de","ö","Grundschule Kenn"]
[14492,"GS Kerzenheim","Schulstr. 5",67304,"Kerzenheim","(06351)7252","grundschule@kerzenheim.de","ö","Grundschule Kerzenheim"]
[14505,"GS Kettig","Schulstr. 6",56220,"Kettig","(02637)2243","gs-kettig@t-online.de","ö","Grundschule Kettig"]
[14518,"GS Kinderbeuern","Schulstraße 43",54538,"Kinderbeuern","(06532)2065","GS-Alftal@t-online.de","ö","Grundschule Alftal"]
[14523,"GS Kindsbach","Schulstr. 4",66862,"Kindsbach","(06371)62114","gskindsbach@vglandstuhl.de","ö","Grundschule Kindsbach"]
[14536,"GS Kirchberg","Schulstraße 15",55481,"Kirchberg","06763/30335-0","gs-kirchberg@web.de","ö","Freiherr-von-Drais","Grundschule Kirchberg"]
[14549,"GS Kirchen Michael","Auf dem Molzberg 8",57548,"Kirchen","027416604(Sekret","sekretariat @michaelschule-kirchen.de","ö","Michaelschule","Grundschule"]
[14566,"GS Kirchheimbolanden","Linsenpfad 4",67292,"Kirchheimbolanden","(06352)3674","sekretariat@grundschule-kirchheimbolande","ö","Grundschule Kirchheimbolanden"]
[14579,"GS Kirchwald","Hauptstraße 2",56729,"Kirchwald","(02651)2113","GSKiwa@gmx.de","ö","Grundschule Kirchwald"]
[14608,"GS Kirrweiler","Hauptstr. 14",67489,"Kirrweiler","(06321)59585","schulleitung@gs-kirrweiler.bildung-rp.de","ö","Grundschule Kirrweiler"]
[14613,"GS Klein-Winternheim","Am Bandweidenweg 3",55270,"Klein-Winternheim","(06136)87010","grundschule@klein-winternheim.de","ö","Paul Klee Grundschule","Klein-Winternheim"]
[14626,"GS Kleinich","Ortsstraße 35",54483,"Kleinich","(06536)351","info@gskleinich.de","ö","Grundschule Kleinich"]
[14639,"GS Klingenmünster","Schulstraße 5",76889,"Klingenmünster","(06349)8818","Grundschule_Klingenmuenster@t-online.de","ö","August-Becker-Schule"]
[14656,"GS Koblenz Am Löwentor","Finkenherd 2",56075,"Koblenz","(0261)56533","info@gsloewentor.bildung.koblenz.de","ö","Grundschule Am Löwentor"]
[14672,"GS Koblenz-Güls","Karl-Möhlig-Str. 12a",56072,"Koblenz","(0261)29184830","gsguels@gmx.de","ö","Grundschule Koblenz-Güls"]
[14686,"GS Koblenz-Horchheim","Kirchstraße 8",56076,"Koblenz","(0261)76551","info@grundschule-horchheim.de","ö","Joseph-Mendelssohn-Schule","Grundschule Horchheim"]
[14699,"GS Koblenz-Kesselheim","Kurfürst-Schönborn-Str. 55",56070,"Koblenz","(0261)83301","GS_Kesselheim@t-online.de","ö","Grundschule Kesselheim"]
[14703,"GS Koblenz-Lay","Karolastr. 2",56073,"Koblenz","(02606)555","schulleitung@gs-lay.bildung-rp.de","ö","Grundschule Lay"]
[14716,"GS Koblenz-Lützel","Weinbergstraße 4",56070,"Koblenz","(0261)82273","schulleitung@regenbogengs.de","ö","Regenbogen-Grundschule"]
[14729,"GS Koblenz-Oberdorf","Raiffeisenstr. 6",56072,"Koblenz","(0261)22540","info@gsoberdorf.bildung.koblenz.de","ö","Grundschule Oberdorf"]
[14733,"GS Koblenz-Moselweiß","Schulgasse 16",56073,"Koblenz","(0261)42604","GS-Moselweiss@posteo.de","ö","Grundschule Moselweiß"]
[14746,"GS Koblenz-Neukarthause","Zwickauer Str. 23",56075,"Koblenz",26153747,"info@gsneukarthause.bildung.koblenz.de","ö","Grundschule Neukarthause"]
[14759,"GS Koblenz-Niederberg","Niederberger Höhe 16",56077,"Koblenz","(0261)9634930","gs-ko-niederberg@gmx.de","ö","Grundschule Niederberg"]
[14762,"GS Koblenz-Pfaffendorf","Emser Str. 125",56076,"Koblenz","(0261)73814","info@gspfaffendorf.bildung.koblenz.de","ö","Grundschule Pfaffendorf"]
[14776,"GS Koblenz-Pfaffendorfer Höhe","K.-Friedrich-Goerdeler-Str. 8",56076,"Koblenz","(0261)75227","info@bngs.bildung-rp.de","ö","Balthasar-Neumann-Schule","Grundschule Pfaffendorfer Höhe"]
[14789,"GS Koblenz-Wallersheim","Kammertsweg 27",56070,"Koblenz","(0261)82285","gs-wallersheim@adams-ko.de","ö","Grundschule Wallersheim"]
[14792,"GS Konken","Schulstr. 4",66871,"Konken","(06384)222","gskonken@gmx.de","ö","Grundschule Konken"]
[14819,"GS Konz-Oberemmel","Kirchstr. 39",54329,"Konz","(06501)15303","gs.oberemmel@konz.de","ö","Grundschule Oberemmel"]
[14849,"GS Kriegsfeld","Hinter Kirch 8",67819,"Kriegsfeld","(06358)450","sekretariat@grundschule-kriegsfeld.de","ö","Wetterhaag-Schule. Grundschule"]
[14866,"GS Kroppach","An der Schule 5",57612,"Kroppach","(02688)561","info@grundschule-kroppach.de","ö","Grundschule Kroppach"]
[14882,"GS Mayen-Kürrenberg","St.-Bernhard-Straße 16",56727,"Mayen","(02651)903020","kuerrenberg@gs-my.de","ö","Grundschule Kürrenberg"]
[14896,"GS Kusel","Luitpoldstraße 14",66869,"Kusel","(06381)7660","schulleitung@grundschule-kusel.de","ö","Grundschule Kusel"]
[14913,"GS Lahnstein Goethe","Stauffenbergstr. 13",56112,"Lahnstein","(02621)9173-0","goetheschule@-lahnstein.de","ö","Goetheschule","Grundschule"]
[14926,"GS Lahnstein Friedrichssegen","Erzbachstr. 42",56112,"Lahnstein","(02621)3102","gs-friedrichssegen@lahnstein.de","ö","Grundschule Friedrichssegen"]
[14942,"GS Landau-Arzheim","Arzheimer Hauptstr. 84",76829,"Landau in der Pfalz","(06341)31280","GS_Arzheim@web.de","ö","Grundschule Arzheim"]
[14956,"GS Landau-Dammheim","Bornheimer Str. 22",76829,"Landau in der Pfalz","(06341)134400","gs.dammheim@landau.de","ö","Grundschule Dammheim"]
[14969,"GS Landau-Godramstein","Godramsteiner Hauptstr. 94",76829,"Landau in der Pfalz","(06341)13-4430","GS-Godramstein@landau.de","ö","Grundschule Godramstein"]
[14999,"GS Landau-Nussdorf","Kirchstr. 34",76829,"Landau in der Pfalz","(06341)134450","gs-nussdorf@landau.de","ö","Grundschule Nussdorf"]
[15004,"GS Landau-Queichheim","Queichheimer Hauptstr. 84",76829,"Landau in der Pfalz","(06341)50515","gs-queichheim@landau.de","ö","Michael-Ende-Grundschule","Landau-Queichheim"]
[15017,"GS Landkern","Hauptstraße 25",56814,"Landkern","(02653)6919","schulverband-landkern@kaisersesch.de","ö","Grundschule Landkern"]
[15020,"GS Landscheid","Schulstr. 11",54526,"Landscheid","(06575)4453","schulleitung@gslandscheid.de","ö","Grundschule Landscheid"]
[15033,"GS Landstuhl In der Au","Römerstr. 88",66849,"Landstuhl","(06371)2622","auschule@vglandstuhl.de","ö","Grundschule In der Au"]
[15047,"GS Langenfeld","Adenaustr. 16",56729,"Langenfeld","(02655)2810","GS-Langenfeld@gmx.de","ö","Grundschule Langenfeld"]
[15050,"GS Langenlonsheim","Sonnenberg Campus 5",55450,"Langenlonsheim","(06704)961619","sekretariat@gs-lalo.bildung-rp.de","ö","Grundschule am Sonnenberg","Langenlonsheim"]
[15063,"GS Langsur","Wasserbilliger Str. 25",54308,"Langsur","(06501)14405","gs-langsur@online.de","ö","Grundschule Langsur"]
[15093,"GS Laufeld","Bahnhofstr. 14",54533,"Laufeld","(06572)4033","schulleitung@grundschule-laufeld.de","ö","Grundschule Laufeld"]
[15110,"GS Laumersheim","Schulstraße 6",67229,"Laumersheim","(06238)2163","sekretariat@gs-gerolsheim-laumersheim.de","ö","Grundschule","Gerolsheim-Laumersheim"]
[15123,"GS Lauterecken","Schulstr. 14",67742,"Lauterecken","(06382)8309","gs-lauterecken@vg-lw.de","ö","Grundschule Lauterecken"]
[15137,"GS Leiwen","Schulstr. 10",54340,"Leiwen","(06507)3763","gs-leiwen@vg-schweich.de","ö","Grundschule Leiwen"]
[15140,"GS Lieser","Beethovenstr. 5",54470,"Lieser","(06531)8766","info@gs-lieser.bildung-rp.de","ö","Lesura-Grundschule","Lieser"]
[15153,"GS Asbach-Limbach","Altenkirchener Str. 20",53567,"Asbach","(02683)6116","Grundschule-Limbach@t-online.de","ö","Grundschule Limbach"]
[15167,"GS Linden","Schulstr. 4",66851,"Linden","(06307)1686","gs.linden@gmx.de","ö","Grundschule Linden"]
[15170,"GS Lindenberg","Hauptstraße 49",67473,"Lindenberg","(06325)7672","grundschule-lindenberg@web.de","ö","Grundschule Lindenberg"]
[15197,"GS Lissendorf","Schulstraße 8",54587,"Lissendorf","(06597)9249884","gs-lissendorf@gerolstein.de","ö","Grundschule Lissendorf"]
[15200,"GS Löf","Bahnhofstraße",56332,"Löf","(02605)4675","loef@gsrheinmosel.de","ö","Grundschule Löf"]
[15227,"GS Longkamp","Schulstr. 12",54472,"Longkamp","(06531)4839","Grundschule-Longkamp@t-online.de","ö","Grundschule Longkamp"]
[15230,"GS Longuich","Maximinstr. 2",54340,"Longuich","(06502)8576","gslonguich@web.de","ö","Grundschule Longuich"]
[15257,"GS Mainz Eisgrub","Eisgrubweg 1",55116,"Mainz","(06131)221235","schule.eisgrub@stadt.mainz.de","ö","Eisgrubschule","Grundschule Altstadt"]
[15260,"GS Mainz-Bretzenheim Mumbächer","Essenheimer Str. 40",55128,"Mainz","(06131)361074","schule.heinrich-mumbaecher@stadt.mainz.d","ö","Heinrich-Mumbächer-Schule","Grundschule Bretzenheim"]
[15273,"GS Mainz-Drais","Daniel-Brendel-Str. 11",55127,"Mainz","(06131)477553","schule.marc-chagall@stadt.mainz.de","ö","Grundschule Drais"]
[15287,"GS Mainz-Ebersheim","Feldgartenstr. 3",55129,"Mainz","(06136)43030","schule.im-feldgarten@stadt.mainz.de","ö","Grundschule","Ebersheim"]
[15290,"GS Mainz-Laubenheim","Riedweg 18b",55130,"Mainz","(06131)87483","schule.laubenheim@stadt.mainz.de","ö","Grundschule Mainz-Laubenheim"]
[15303,"GS Mainz-Marienborn","Gottfried-Schwalbach-Straße 35",55127,"Mainz","(06131)362516","schule.marienborn@stadt.mainz.de","ö","Brunnenschule Mainz-Marienborn"]
[15317,"GS Mainz-Zahlbach","Am Wildgraben 29",55128,"Mainz","(06131)369045","schule.an-den-roemersteinen@stadt.mainz.","ö","Schule an den Römersteinen","Grundschule Zahlbach"]
[15347,"GS Manderscheid","Cusanusstr. 7",54531,"Manderscheid","(06572)921650","schulleitung@grundschule-manderscheid.de","ö","Grundschule Manderscheid"]
[15350,"GS Maring-Noviand","Serginer Platz 4",54484,"Maring-Noviand","(06535)290","info@gs-maring-noviand.bildung-rp.de","ö","Grundschule Maring-Noviand"]
[15363,"GS Marnheim","Kirchstraße 17",67297,"Marnheim","06352-2557","sekretariat@grundschule-marnheim.de","ö","Grundschule Marnheim"]
[15380,"GS Laubach-Masburg","Bergstraße 2a",56759,"Laubach","(02653)1323","schieferland-gs@kaisersesch.de","ö","Schieferland-Grundschule","Laubach-Masburg"]
[15407,"GS Malborn","Hauptstr. 61",54426,"Malborn","(06504)8078","gs.malborn@gmx.de","ö","Auenland Grundschule Malborn"]
[15410,"GS Maxdorf","Carl-Bosch-Straße 16a",67133,"Maxdorf","(06237)7007","Haidwaldschule@vg-maxdorf.de","ö","Grundschule Haidwald"]
[15423,"GS Wörth Maximiliansau","Tullastraße 17",76744,"Wörth am Rhein","(07271)131370","gs-tullaschule@woerth.de","ö","Johann-Gottfried-Tulla-Schule","Grundschule Maximiliansau"]
[15437,"GS Mayen Hausen","Bahnhofstr. 2",56727,"Mayen","(02651)490815","info@grundschule-hausen.de","ö","Grundschule Martinsburg","Hausen"]
[15440,"GS Meckenheim","Schulstr. 1",67149,"Meckenheim","(06326)8741","info@gsmeckenheim.de","ö","Grundschule Meckenheim"]
[15453,"GS Mehlbach","Hauptstr. 25",67735,"Mehlbach",null,null,"ö","Grundschule Mehlbach"]
[15467,"GS Mehlingen","Hauptstr. 11",67678,"Mehlingen",63036566,null,"ö","Grundschule Mehlingen"]
[15470,"GS Mehren","Kapellenstr. 13",54552,"Mehren","(06592)3225","info@gtgs-mehren.bildung-rp.de","ö","Grundschule Mehren"]
[15483,"GS Meisenheim","Präses-Held-Straße 7",55590,"Meisenheim","(06753)2696","sekretariat@grundschule-meisenheim.de","ö","Astrid-Lindgren-Schule","Grundschule Meisenheim"]
[15496,"GS Melsbach","Friedrich-Ebert-Straße 21a",56581,"Melsbach","(02634)8305","grundschule@gemeinde-melsbach.de","ö","Grundschule Melsbach"]
[15543,"GS Minfeld","Herrengasse 7",76872,"Minfeld","(07275)1549","sekretariat@gs-minfeld.de","ö","Grundschule Minfeld"]
[15560,"GS Mörsdorf","Kirchstraße 5",56290,"Mörsdorf","(06762)6580","grundschule.moersdorf@t-online.de","ö","Grundschule Mörsdorf"]
[15573,"GS Mommenheim","Schulstr. 16",55278,"Mommenheim","(06138)941095","schulleitung@grundschule-mommenheim.de","ö","Grundschule Mommenheim"]
[15586,"GS Monreal","Am Bahnhof 4",56729,"Monreal","(02651)76176","info@grundschule-monreal.de","ö","Grundschule Monreal"]
[15590,"GS Monsheim","Moltkestr. 5",67590,"Monsheim","(06243)7533","sekretariat@gs-monsheim.de","ö","Grundschule Monsheim"]
[15603,"GS Monzelfeld","Alte Poststr. 3",54472,"Monzelfeld","(06531)6183","gsmonzelfeld@gmx.de","ö","Grundschule Monzelfeld"]
[15617,"GS Monzingen","Beindestr. 18",55569,"Monzingen","(06751)2134","info@gs-monzingen.de","ö","Grundschule Monzingen"]
[15620,"GS Morbach Mitte","Schulstr. 21",54497,"Morbach","(06533)941100","info@grundschule-morbach.de","ö","Grundschule Morbach"]
[15633,"GS Morbach Blandine-Merten","Laurentiusstraße 19",54497,"Morbach","(06533)3145","gsblandinemerten@gmx.de","ö","Blandine-Merten-Schule","Grundschule Morscheid"]
[15647,"GS Ludwigshafen Mozart","Hilgundstraße 21",67067,"Ludwigshafen am Rhein","(0621)504423110","info@mozart-rhg.de","ö","Mozartschule","Grundschule Rheingönheim"]
[15650,"GS Andernach Martin","Frankenstr. 43",56626,"Andernach","(02632)1241","gsmartin@gmx.de","ö","Martinschule","Grundschule"]
[15663,"GS Mülheim","Schulweg 4",54486,"Mülheim an der Mosel","(06534)777","info@gs-muelheim.bildung-rp.de","ö","Grundschule Mülheim"]
[15676,"GS Münchweiler/Alsenz","Ringstr. 23",67728,"Münchweiler an der Alsenz","(06302)3026","astrid-lindgren-gs@t-online.de","ö","Astrid Lindgren-Schule","Grundschule Münchweiler/Alsenz"]
[15680,"GS Münster-Sarmsheim","Schulstr. 15",55424,"Münster-Sarmsheim","(06721)45678","grundschuleamnahetor@vgrn.de","ö","Grundschule Münster-Sarmsheim"]
[15693,"GS Müschenbach","Schulstr. 24",57629,"Müschenbach","(02662)6390","info@gs-mueschenbach.de","ö","Sonnenbergschule Müschenbach"]
[15707,"GS Mutterstadt im Mandelgraben","Pfalzring 88",67112,"Mutterstadt","(06234)928526","gs-im-mandelgraben@mutterstadt.de","ö","Grundschule \"Im Mandelgraben\""]
[15710,"GS Mutterstadt Pestalozzi","Fußgönheimer Straße 17",67112,"Mutterstadt","(06234)928545","gs@pestalozzi-mutterstadt.de","ö","Pestalozzi-Schule","Grundschule"]
[15723,"GS Andernach-Namedy","Hauptstr. 56",56626,"Andernach","(02632)1247","grundschule-namedy@t-online.de","ö","Grundschule Namedy"]
[15737,"GS Nanzdietschweiler","Bahnhofstr. 10",66909,"Nanzdietschweiler","(06383)1401","gs-ndw@myquix.de","ö","Gräfin von der Leyen Grundschu"]
[15766,"GS Neidenbach","Bachstr. 27",54657,"Neidenbach","(06563)2510","gs.neidenbach@t-online.de","ö","Grundschule Neidenbach"]
[15770,"GS Neroth","Schulstraße 2",54570,"Neroth","(06591)4267","grundschule.neroth@gmx.de","ö","Grundschule Neroth"]
[15783,"GS Neuburg","In der Wörthenlache 1",76776,"Neuburg am Rhein","(07273)4340","grundschule_neuburg@gmx.de","ö","Grundschule","an Rhein und Lauter"]
[15796,"GS Züsch","Schulstr. 5",54422,"Züsch","(06503)8880","grundschule.zuesch@t-online.de","ö","Grundschule Züsch"]
[15813,"GS Neunkhausen","Kirchstraße 11",57520,"Neunkhausen","(02661)63793","GS-Neunkhausen@t-online.de","ö","Grundschule Neunkhausen"]
[15827,"GS Neunkirchen","Finkenbergstr. 7",66887,"Neunkirchen","(06385)5283","Potzbergschule-Neunkirchen@web.de","ö","Potzbergschule"]
[15830,"GS Neustadt Brüder-Grimm","Kirchwiesenstr. 4",67434,"Neustadt","(06321)88852","Brueder-Grimm-Schule@schulen-nw.de","ö","Brüder-Grimm-Schule","Grundschule Diedesfeld"]
[15843,"GS Neustadt Geinsheim","Am Hägfeld 44",67435,"Neustadt","(06327)2378","gs-geinsheim@schulen.neustadt.eu","ö","Schule am Storchennest","Grundschule Geinsheim"]
[15856,"GS Neustadt Michael-Ende","Mandelring 92",67433,"Neustadt","(06321)6186","gs-michael-ende@nw.bildung-rp.de","ö","Michael-Ende-Schule","Grundschule Haardt"]
[15873,"GS Neuwied Geschwister-Scholl","Wallstraße 2",56564,"Neuwied","(02631)23379","geschwister-scholl-schule@schulen-neuwie","ö","Grundschule Geschwister-Scholl"]
[15886,"GS Neuwied-Feldkirchen","Schillerstr. 41",56567,"Neuwied","(02631)72348","gs-feldkirchen@schulen-neuwied.de","ö","Grundschule Feldkirchen"]
[15890,"GS Neuwied-Gladbach","Frans-Hals-Straße 6",56566,"Neuwied","(02631)49133","www.wuelfersberg-grundschule@schulen-neu","ö","Wülfersberg-Schule","Grundschule Gladbach"]
[15903,"GS Nieder-Olm","Burgstr. 15",55268,"Nieder-Olm","(06136)919840","post@burgschule-nieder-olm.de","ö","Grundschule Nieder-Olm","Burgschule"]
[15917,"GS Neuwied-Niederbieber","In der Lach 1",56567,"Neuwied","(02631)53022","gs-an-der-wied@schulen-neuwied.de","ö","Grundschule an der Wied","Neuwied-Niederbieber"]
[15920,"GS Niederbreitbach","Kurtscheider Straße 14",56589,"Niederbreitbach","(02638)5099","info@grundschule-niederbreitbach.de","ö","Neuerburgschule","Grundschule"]
[15933,"GS Niederdürenbach","In der Hohl 16",56651,"Niederdürenbach","(02636)6305","gsniederduerenbach@brohltal-schulen.de","ö","Grundschule am Maar"]
[15946,"GS Ludwigshafen Niederfeld","Niederfeldstraße 1",67065,"Ludwigshafen am Rhein",6.2150442331000002E+21,"info@gs-niederfeld.de","ö","Niederfeldschule","Grundschule"]
[15950,"GS Niederfischbach","Rothenbergstr. 15",57572,"Niederfischbach","(02734)61258Büro","ketteler-schule@freenet.de","ö","W.E. Ketteler-Schule","Grundschule"]
[15963,"GS Niederkirchen/Otterberg","Schulstr. 7",67700,"Niederkirchen",6363205,"gs.niederkirchen@otterbach-otterberg.de","ö","Grundschule Niederkirchen"]
[15993,"GS Niederwerth","Schützenstraße 23",56179,"Niederwerth","(0261)64501","grundschule@niederwerth.de","ö","Grundschule Niederwerth"]
[16011,"GS Nittel","Mühlenweg 4",54453,"Nittel",null,null,"ö","Grundschule Nittel"]
[16037,"GS Bad Kreuznach Hofgartenstraße","Hofgartenstraße 14",55545,"Bad Kreuznach","(0671)26119","gs-hofgarten@bad-kreuznach.de","ö","Grundschule Hofgartenstraße"]
[16041,"GS Norheim","Schulstraße 11",55585,"Norheim","(0671)30827","schule@gs-norheim.de","ö","Grundschule St. Martin"]
[16054,"GS Norken","Schulstr. 1",57629,"Norken","(02661)3440","info@grundschule-norken.de","ö","Unesco-Grundschule Norken"]
[16067,"GS Nußbach","Schulstr. 12",67759,"Nußbach","(06364)433","gsnussbach@t-online.de","ö","Grundschule Nußbach"]
[16097,"GS Oberkail","Schulstr. 9",54533,"Oberkail","(06567)331","info@gs-oberkail.de","ö","Grundschule Oberkail"]
[16101,"GS Oberlahr","Hauptstraße 10",57641,"Oberlahr","02685-613","info@gs-oberlahr.bildung-rp.de","ö","Grundschule","Lahrer Herrlichkeit"]
[16127,"GS Oberwesel","Liebfrauenstr. 29",55430,"Oberwesel","(06744)94010","elfenley@grundschule-oberwesel.de","ö","Elfenley-Grundschule"]
[16144,"GS Ockenheim","Mainzer Str. 67",55437,"Ockenheim","(06725)2216","gs-am-jakobsberg@gmx.de","ö","Grundschule am Jakobsberg"]
[16161,"GS Odernheim","Turnhallstr. 3",55571,"Odernheim am Glan","(06755)1410","gs-odernheim@vg-nahe-glan.de","ö","Disibodenbergschule","Grundschule"]
[16187,"GS Offstein","Johann-Peter-Schneider-Str. 1",67591,"Offstein","(06243)7185","sekretariat@gs-offstein.de","ö","Grundschule am Engelsberg"]
[16217,"GS Orenhofen","Merscheiderweg 21",54662,"Speicher",65629655271,"grundschule@orenhofen.de","ö","Astrid-Lindgren-Grundschule","GS Orenhofen"]
[16234,"GS Neustadt Gimmeldingen","Kirchplatz 5",67435,"Neustadt","(06321)69532","gs-gimmeldingen@schulen.neustadt.eu","ö","Grundschule Gimmeldingen"]
[16247,"GS Osann-Monzel","Bernkasteler Str. 10",54518,"Osann-Monzel","(06535)7329","schulleitung@gsosann-monzel.de","ö","Grundschule Osann-Monzel"]
[16251,"GS Bad Kreuznach Martin-Luther-King","Richard-Wagner-Str. 39",55543,"Bad Kreuznach","(0671)67780","gs-maluki@bad-kreuznach.de","ö","Dr. Martin-Luther-King-Schule","Grundschule"]
[16264,"GS Osterspai","Filsener Straße 103",56340,"Osterspai","(02627)210","info@grundschule-osterspai.de","ö","Willy-Brandt-Grundschule"]
[16281,"GS Otterberg","Hauptstr. 20",67697,"Otterberg","06301-2537","gs.otterberg@otterbach-otterberg.de","ö","Otfried-Preußler-Grundschule"]
[16294,"GS Otterstadt","Luitpoldstraße 1",67166,"Otterstadt","(06232)34949","grundschule@otterstadt.de","ö","Grundschule Otterstadt"]
[16311,"GS Pellingen","Schulstr. 9",54331,"Pellingen","(06588)480","grundschule-pellingen@konz.de","ö","Grundschule St. Antonius"]
[16337,"GS Koblenz Pestalozzi","Gutenbergstr. 30",56073,"Koblenz","(0261)41104","schulleitung@pestalozzischule-koblenz.de","ö","Grundschule Pestalozzi"]
[16367,"GS Mendig Pfarrer Bechtel","Friedrich-Ebert-Str. 1",56743,"Mendig","(02652)4534","gs-mendig.pretz@gmx.de","ö","Grundschule Pfarrer Bechtel"]
[16371,"GS Ludwigshafen Pfingstweide","Budapester Straße 30-32",67069,"Ludwigshafen am Rhein","(0621)504423510","info@gs-pfingstweide.de","ö","Grundschule Pfingstweide"]
[16384,"GS Piesport","Schulstr. 16",54498,"Piesport","(06507)5115","info@gs-piesport.bildung-rp.de","ö","Grundschule Piesport"]
[16397,"GS Pirmasens Robert-Schuman","Adlerstraße 21",66955,"Pirmasens","(06331)286404-0","gs.robert.schuman@pirmasens.de","ö","Robert-Schuman-Grundschule"]
[16414,"GS Pirmasens-Sommerwald","Unterer Sommerwaldweg 148",66953,"Pirmasens","(06331)51460","gs.sommerwald@pirmasens.de","ö","Grundschule Sommerwald"]
[16427,"GS Pirmasens-Wittelsbach","Maler-Bürkel-Str. 24",66954,"Pirmasens","(06331)517312","gs.wittelsbach@pirmasens.de","ö","Wittelsbach-Schule","Grundschule"]
[16444,"GS Pirmasens-Fehrbach","St. Josefstr. 1",66954,"Pirmasens","(06331)95159","gs.fehrbach@pirmasens.de","ö","Grundschule Fehrbach"]
[16457,"GS Pirmasens-Ruhbank/Erlenbrunn","Schulstr. 12",66955,"Pirmasens","(06331)21150","gts.ruhbank@pirmasens.de","ö","Grundschule Ruhbank/Erlenbrunn"]
[16461,"GS Bad Kreuznach Planig","Am Winzerkeller 2",55545,"Bad Kreuznach","(0671)66278","gs-planig@bad-kreuznach.de","ö","Grundschule Planig"]
[16474,"GS Gusterath","Am Schulplatz 1",54317,"Gusterath","(06588)2663","grundschule.gusterath@ruwer.de","ö","Grundschule St. Martin","Gusterath-Pluwig"]
[16521,"GS Preist","Schulstr. 20",54664,"Preist","(06562)8482","grundschule-preist@t-online.de","ö","Grundschule St. Cäcilia"]
[16534,"GS Prüm","Kalvarienbergstr. 25",54595,"Prüm","(06551)95670","Bertrada-GS@t-online.de","ö","Bertrada-Grundschule"]
[16547,"GS Puderbach","Schulstraße 16-18",56305,"Puderbach","02684-3530","info@holzbachtalschule.de","ö","Holzbachtalschule","Grundschule"]
[16551,"GS Queidersbach","Jahnstraße 23a",66851,"Queidersbach","(06371)14837","gs.queidersbach@gmx.de","ö","Grundschule Queidersbach"]
[16564,"GS Ralingen","Schulstr. 8",54310,"Ralingen","(06585)246","gs-ralingen@online.de","ö","Grundschule Ralingen"]
[16577,"GS Ramsen","Klosterstr. 18",67305,"Ramsen","(06351)5109","grundschule-ramsen@web.de","ö","Grundschule Ramsen"]
[16580,"GS Ramstein-Miesenbach","Nollstr. 32",66877,"Ramstein-Miesenbach","(06371)952818","info@gs-ramstein.de","ö","Wendelinusschule","Gemeinsame Grundschule"]
[16595,"GS Ransbach-Baumbach","Mozartstraße 8",56235,"Ransbach-Baumbach","(02623)2900","kontakt@aliraba.de","ö","Astrid-Lindgren-Schule"]
[16607,"GS Raubach","In der Au 1",56316,"Raubach",26845302,"sekretariat@grundschule-raubach.de","ö","Grundschule Raubach"]
[16641,"GS Reinsfeld","Römerstraße 1",54421,"Reinsfeld","(06503)577","grundschule-reinsfeld@t-online.de","ö","Grundschule Reinsfeld"]
[16654,"GS Riesweiler","Schulstr. 2",55499,"Riesweiler","(06761)970840","info@gs-riesweiler.de","ö","Soonblick-Grundschule Riesweil"]
[16667,"GS Remagen-Kripp","Pastor-Keller-Str. 9",53424,"Remagen","(02642)44328","sekretariat@grundschule-kripp.com","ö","Grundschule Kripp"]
[16685,"GS Rennerod","Westernoher Str. 30",56477,"Rennerod","(02664)6360","steinsberg.grundschule@t-online.de","ö","Steinsbergschule","Grundschule"]
[16701,"GS Rhaunen","Am Sonnenschlicher 5",55624,"Rhaunen","(06544)99911-13","schulleitung@gsidarwald.de","ö","Grundschule Idarwald"]
[16714,"GS Rheinböllen","Marktstr. 47",55494,"Rheinböllen","06764-960110","info@grundschule-rheinboellen.de","ö","Grundschule Rheinböllen","Am Hochsteinchen"]
[16727,"GS Rheinbreitbach","Schulstr. 4",53619,"Rheinbreitbach","(02224)3307","GebruederGrimmSchule@t-online.de","ö","Gebrüder-Grimm-Schule","Grundschule"]
[16731,"GS Rhodt","Herrengasse 5",76835,"Rhodt unter Rietburg","(06323)2162","schulleitung@gs-rhodt.de","ö","Grundschule","Rhodt unter Rietburg"]
[16744,"GS Rockenhausen","Brühlgasse 21",67806,"Rockenhausen","(06361)9241-0","anne-frank-grundschule@bildung-nl.de","ö","Anne-Frank-Grundschule"]
[16757,"GS Rodalben","Mozartplatz 1",66976,"Rodalben","(06331)258150","Grundschule@Rodalben-Stadt.de","ö","Mozartschule","Grundschule"]
[16775,"GS Rödersheim-Gronau","Schäfergasse 49",67127,"Rödersheim-Gronau",null,null,"ö","Grundschule Am Neuberg"]
[16788,"GS Römerberg-Heiligenstein","Am Rathaus 6",67354,"Römerberg","(06232)656195","gsheiligenstein@gmx.de","ö","Grundschule Heiligenstein"]
[16791,"GS Römerberg-Mechtersheim","Schwarzwaldweg 3",67354,"Römerberg","(06232)82890","kontakt@gs-mechtersheim.de","ö","Grundschule Mechtersheim"]
[16817,"GS Rohrbach","Am Dorfplatz 1",76865,"Rohrbach","(06349)8333","gs-rohrbach@gmx.de","ö","Grundschule am Mandelbaum"]
[16821,"GS Koblenz-Rohrerhof","Trierer Str. 130",56072,"Koblenz","(0261)22567","GSRohrerhof@t-online.de","ö","Grundschule Rohrerhof"]
[16834,"GS Roschbach","Schulstr. 16",76835,"Roschbach","(06323)2240","sekretariat@gs-roschbach.de","ö","Grundschule Roschbach"]
[16847,"GS Roßbach","Schulstr. 7",56271,"Roßbach","(02680)717","info@grundschule-rossbach.de","ö","Otfried-Preussler-Grundschule"]
[16865,"GS Roxheim","Rüdesheimer Str. 10",55595,"Roxheim","(0671)32282","schule@gs-roxheim.de","ö","Grundschule Roxheim"]
[16878,"GS Ludwigshafen Astrid-Lindgren","Kurt-Kreiselmaier-Platz 1",67071,"Ludwigshafen am Rhein","(0621)504420510","info@gsal.bildung-rp.de","ö","Astrid Lindgren-Schule","Grundschule"]
[16895,"GS Rülzheim","Schulstr. 15",76761,"Rülzheim","(07272)8909","info@grundschule-ruelzheim.de","ö","Grundschule Rülzheim"]
[16907,"GS Rümmelsheim","Schulstraße 4",55452,"Rümmelsheim","(06721)42772","info@gs-ruemmelsheim.bildung-rp.de","ö","Grundschule Rümmelsheim"]
[16940,"GS Wörth Schaidt","Hauptstr. 85",76744,"Wörth am Rhein","(07271)131290","gs-schaidt@woerth.de","ö","St.Nepomuk-Grundschule Schaidt"]
[16955,"GS Schalkenbach","Schulstraße 35",53426,"Schalkenbach","(02646)513","gsschalkenbach@brohltal-schulen.de","ö","Regenbogenschule","Grundschule"]
[16968,"GS Schallodenbach","Felsstr. 30",67701,"Schallodenbach",63635271,"gs.schallodenbach@otterbach-otterberg.de","ö","Grundschule am Reiserberg"]
[16998,"GS Scheuerfeld","Schulstr. 36",57584,"Scheuerfeld","(02741)23638","gs-scheuerfeld@gmx.de","ö","Maximilian-Kolbe-Schule","Grundschule"]
[17003,"GS Ludwigshafen Mundenheim","Rheingönheimer Straße 103",67065,"Ludwigshafen am Rhein","(0621)504-423910","Sekretariat@Schillerschule-Mundenheim.de","ö","Schillerschule Mundenheim","Grundschule"]
[17016,"GS Schillingen","Schulstraße 21",54429,"Schillingen","(06589)333","post@grundschule-schillingen.de","ö","Grundschule Schillingen"]
[17029,"GS Schöndorf","Hauptstraße 52",54316,"Schöndorf","(06588)401","grundschule.schoendorf@ruwer.de","ö","Enterbach-Grundschule"]
[17032,"GS Schönenberg-Kübelberg","Pestalozzistr. 14",66901,"Schönenberg-Kübelberg","(06373)9871","sekretariat@grundschule-sk.bildung-rp.de","ö","Grundschule Schönenberg-","Kübelberg"]
[17059,"GS Schopp","Hauptstr. 11a",67707,"Schopp","(06307)389","sekretariat@gs-schopp.de","ö","Grundschule Schopp"]
[17062,"GS Schornsheim","Goethestr. 1",55288,"Schornsheim","(06732)3968","info@gs-schornsheim.de","ö","Grundschule Schornsheim"]
[17089,"GS Schwabenheim","Jahnstr. 11",55270,"Schwabenheim an der Selz","(06130)944343","sekretariat@gs-schwabenheim.de","ö","Selztalschule","Grundschule"]
[17122,"GS Irmtraut","Schulstr. 6",56479,"Irmtraut","(06436)3365","loewenzahnschule_gs_irmtraut@localhost","ö","Löwenzahnschule","Grundschule"]
[17136,"GS Serrig","Martinusstr. 27",54455,"Serrig","(06581)2589","grundschule_serrig@web.de","ö","Grundschule Serrig"]
[17149,"GS Siebeldingen","Weinstr. 63",76833,"Siebeldingen","(06345)2980","GS.Sieb@gmx.de","ö","Grundschule im Queichtal"]
[17152,"GS Breitscheid","Marienstr. 4",53547,"Breitscheid","(02638)4966","info@breitscheid-grundschule.de","ö","Marienschule","Grundschule"]
[17166,"GS Siefersheim","In der Heidenhecke 1",55599,"Siefersheim","(06703)1663","gs-siefersheim@woellstein.de","ö","Grundschule Am Martinsberg"]
[17179,"GS Simmern/Hunsrück Rottmann","Poststr. 3",55469,"Simmern","(06761)970297","info@rottmannschule.de","ö","Rottmann-Schule","Grundschule"]
[17182,"GS Sinzig Regenbogen","Dreifaltigkeitsweg 37",53489,"Sinzig","(02642)994511","info@regenbogenschule-sinzig.de","ö","Regenbogenschule","Grundschule"]
[17196,"GS Sinzig-Westum","Lerchenweg 2",53489,"Sinzig","02642-981770","Hellenbachschule@t-online.de","ö","Hellenbachschule","Grundschule Westum"]
[17209,"GS Sippersfeld","Amtsstr. 9a",67729,"Sippersfeld","(06357)7559","info@gs-sippersfeld.de","ö","Grundschule Sippersfeld"]
[17226,"GS Sohren","Schulstr. 9",55487,"Sohren","(06543)3246","grundschule-sohren@t-online.de","ö","Grundschule Sohren"]
[17239,"GS Lonnig","Hinter der Ley 1",56295,"Lonnig","(02625)6639","schulleitung.gs.lo@maifeld.de","ö","St. Jakobus d.Ä.-Grundschule"]
[17272,"GS Speyer Salier","Mausbergweg 144",67346,"Speyer","(06232)141700","sekretariat@salierschule-speyer.de","ö","Salierschule","Grundschule"]
[17286,"GS Speyer Zeppelin","Neufferstr. 1",67346,"Speyer","(06232)141980","sekretariat@zeppelinschule-speyer.de","ö","Zeppelinschule Speyer","Grundschule"]
[17299,"GS Speyer Siedlung","Birkenweg 10",67346,"Speyer","(06232)14-1400","verwaltung@siedlungsgrundschule.de","ö","Siedlungsschule","Grundschule"]
[17302,"GS Speyer Woogbach","Rainer-Maria-Rilke-Weg 25",67346,"Speyer","(06232)141710","verwaltung@woogbachschule.de","ö","Woogbachschule","Grundschule"]
[17332,"GS St. Goar","Am Hafen 6",56329,"Sankt Goar","(06741)7183","gs-stgoar@t-online.de","ö","Rheinfelsschule","Grundschule"]
[17346,"GS Körperich","Gaytalstr. 43",54675,"Körperich","(06566)961300","gs-koerperich@gmx.de","ö","Grundschule Körperich"]
[17359,"GS St. Johann","Kirchstr. 28",56727,"Sankt Johann","(02651)71822","gs-st-johann@t-online.de","ö","Grundschule St. Johann"]
[17362,"GS Konz St. Johann","Albanstraße 8b",54329,"Konz","(06501)3533","gs.st.johann@konz.de","ö","Grundschule St. Johann","- Hauptstelle Konz-Karthaus -"]
[17376,"GS Leutesdorf","Rätsgasse 5",56599,"Leutesdorf","(02631)71396","sekretariat@gs-leutesdorf.de","ö","Grundschule St. Laurentius"]
[17389,"GS Saarburg St. Laurentius","Heckingstr. 13",54439,"Saarburg","(06581)2460","info@gslaurentius.de","ö","Grundschule St. Laurentius"]
[17392,"GS Saarburg St. Marien","Boorwiese 10",54439,"Saarburg","(06581)2701","sekretariat@gsmarien.de","ö","Grundschule St. Marien"]
[17419,"GS Spangdahlem","Schulstraße 28",54529,"Spangdahlem","(06565)4600","verwaltung@gs-spangdahlem.de","ö","Grundschule St. Nikolaus"]
[17436,"GS Pronsfeld","Schulstr. 6",54597,"Pronsfeld","(06556)840","email@grundschule-pronsfeld.de","ö","Grundschule Pronsfeld"]
[17449,"GS Lützkampen","Grenzstr. 11",54617,"Lützkampen","(06559)636","grundschule@luetzkampen.de","ö","Grundschule St. Willibrord"]
[17466,"GS Koblenz St. Castor","Nagelsgasse 6",56068,"Koblenz","(0261)34342","buero@gsstcastor.bildung.koblenz.de","ö","Grundschule St. Castor"]
[17479,"GS Polch","Dechant-Riegel-Straße 21",56751,"Polch","(02654)6557","gs.stgeorg.po@maifeld.de","ö","Grundschule St. Georg"]
[17482,"GS Neuwied-Irlich","Apostelstr. 5",56567,"Neuwied","(02631)71001","st-georg-schule@schulen-neuwied.de","ö","Grundschule Irlich"]
[17495,"GS St. Julian","In der Lenschbach 2",66887,"Sankt Julian","(06387)334","gs-st-julian@t-online.de","ö","Grundschule Sankt Julian"]
[17512,"GS St. Martin","Bergstr. 24",67487,"Sankt Martin","(06323)4094","schulleitung@gs-st-martin.bildung-rp.de","ö","Grundschule St Martin"]
[17542,"GS Staudernheim","Schulstr. 36",55568,"Staudernheim","(06751)6454","info@gs-staudernheim.de","ö","Grundschule Staudernheim"]
[17556,"GS Steinweiler","Jahnstraße 4",76872,"Steinweiler","(06349)939751","Kontakt@gs-steinweiler.de","ö","Grundschule Steinweiler"]
[17569,"GS Steinwenden","Goethestraße 1",66879,"Steinwenden","(06371)50814","gsmobatal@t-online.de","ö","Grundschule Moorbachtal"]
[17572,"GS Stetten","Hohlstr. 6",67294,"Stetten","(06355)2271","sekretariat@grundschule-stetten.de","ö","Grundschule Stetten"]
[17585,"GS Straßenhaus","Schulstr. 7",56587,"Straßenhaus","(02634)4333","info@gs-strassenhaus.de","ö","Grundschule Straßenhaus"]
[17602,"GS Bendorf-Stromberg","Schulstraße 3",56170,"Bendorf","(02601)2466","GS-Stromberg@web.de","ö","Grundschule Stromberg"]
[17616,"GS Bad Kreuznach Kleiststraße","Kleiststraße 900",55543,"Bad Kreuznach","(0671)61362","gs-kleist@bad-kreuznach.de","ö","Grundschule Kleiststraße"]
[17629,"GS Schifferstadt Süd","Jägerstraße 18",67105,"Schifferstadt","(06235)49307-0","gs-sued.schifferstadt@t-online.de","ö","Grundschule Süd"]
[17646,"GS Tawern","Kapellenstr. 3",54456,"Tawern","(06501)17479","GS.Tawern@Konz.de","ö","Grundschule Tawern"]
[17662,"GS Thalfang","In der Nah 1",54424,"Thalfang","(06504)95589-0","grundschule.thalfang@gmx.de","ö","Grundschule Thalfang"]
[17675,"GS Theisbergstegen","Hauptstr. 2",66871,"Theisbergstegen","(06381)1388","info@grundschule-theisbergstegen.de","ö","Grundschule Theisbergstegen"]
[17689,"GS Landstuhl Theodor-Heuss","Königsberger Str. 9",66849,"Landstuhl","(06371)3259","kontakt@theheula.de","ö","Theodor-Heuss-Grundschule","Grundschule Landstuhl-Atzel"]
[17706,"GS Thür","Schulstr. 2",56743,"Thür","(02652)1706","info@gs-thuer.de","ö","Grundschule Thür"]
[17719,"GS Traben-Trarbach","Allwies 20",56841,"Traben-Trarbach","(06541)2380","schulleitung@gs-tt.bildung-rp.de","ö","Grundschule Traben-Trarbach"]
[17749,"GS Trier St. Peter","Oberstr. 8a",54293,"Trier",65164963,"gs-st.Peter@gmx.de","ö","Grundschule St. Peter","Ehrang"]
[17752,"GS Trier-Biewer","Johannes-Kerscht-Str. 9",54293,"Trier","(0651)62905","info@gs-trier-biewer.de","ö","Grundschule am Biewerbach"]
[17765,"GS Trier Johann-Herrmann","Pestalozzistr. 3",54294,"Trier","(0651)88682","gseuren@web.de","ö","Johann-Herrmann-Schule","Grundschule Euren"]
[17779,"GS Trier-Feyen","Estricher Weg 11",54294,"Trier","(0651)99217882","gs-trier-feyen@gmx.de","ö","Grundschule Trier-Feyen"]
[17795,"GS Trier-Irsch","Auf der Neuwies 3",54296,"Trier","(0651)16434","gs.trier-irsch@gmx.de","ö","Grundschule Trier-Irsch"]
[17809,"GS Trier-Mariahof","Am Mariahof 23",54296,"Trier","(0651)31196","verwaltung@gsmariahof.de","ö","Grundschule Mariahof"]
[17812,"GS Trier-Olewig","Auf der Ayl 40",54295,"Trier","(0651)32842","gsolewig@web.de","ö","Grundschule Olewig"]
[17826,"GS Trier-Pallien","Im Sabel 30",54294,"Trier","(0651)86777","gs.pallien@gmx.de","ö","Grundschule Pallien"]
[17839,"GS Trier-Quint","Taubenbergstr. 16",54293,"Trier","(0651)66155","grundschule-quint@web.de","ö","Grundschule Quint"]
[17842,"GS Trier-Reichertsberg","Jahnstr. 32 a",54294,"Trier","(0651)85262","gs.reichertsberg@gmx.net","ö","Grundschule Reichertsberg"]
[17855,"GS Trier-Tarforst","Am Trimmelter Hof 206",54296,"Trier","(0651)10326","info@gstarforst.de","ö","Grundschule Tarforst"]
[17869,"GS Trippstadt","Steiggasse 5",67705,"Trippstadt","(06306)1605","gs.trippstadt@vglandstuhl.de","ö","Wilensteinschule","Grundschule"]
[17872,"GS Trittenheim","Johann-Trithemius-Str. 32",54349,"Trittenheim","06507/5080","info@gstrittenheim.bildung-rp.de","ö","Grundschule Trittenheim"]
[17899,"GS Üdersdorf","Neue Schulstr. 37",54552,"Üdersdorf","(06596)267","gs-uedersdorf@web.de","ö","Grundschule Üdersdorf"]
[17916,"GS Uersfeld","Römerhügel 5",56767,"Uersfeld","(02657)941091","gsuersfeld@grundschule-uersfeld.bildung-","ö","Grundschule Uersfeld"]
[17945,"GS Üxheim","Schulstr. 1",54579,"Üxheim","(02696)329","schule@guex.de","ö","Grundschule Üxheim"]
[17959,"GS Ulmet","Schulstr. 6",66887,"Ulmet","(06387)7335","info@gsulmet.bildung-rp.de","ö","Grundschule Ulmet"]
[17962,"GS Unkel","Schulstraße 6",53572,"Unkel","(02224)6504","sekretariat-grundschule-unkel@gmx.de","ö","Grundschule Am Sonnenberg"]
[17989,"GS Urbach","Postweg",56317,"Urbach","(02684)4266","schulleitung@maerkerwald-schule.de","ö","Märkerwald-Schule","Grundschule"]
[18007,"GS Vallendar","Schulstr. 7",56179,"Vallendar","(0261)65323","info@grundschule-vallendar.de","ö","Grundschule Vallendar"]
[18010,"GS Veldenz","Schulstr. 7",54472,"Veldenz","(06534)517","info@gs-veldenz.bildung-rp.de","ö","Grundschule Veldenz"]
[18053,"GS Ingelheim Wackernheim","Taunusstr. 1",55263,"Ingelheim am Rhein","(06132)59018","leitung-gsw@ingelheim.de","ö","Grundschule Wackernheim"]
[18066,"GS Waldalgesheim","Schulstraße 12",55425,"Waldalgesheim","(06721)3059933","schulleitung@gs-waldalgesheim.bildung-rp","ö","Grundschule Waldalgesheim","Astrid-Lindgren-Schule"]
[18083,"GS Waldesch","Rhenser Straße 5",56323,"Waldesch","(02628)988317","info@grundschule-waldesch.de","ö","Grundschule Waldesch"]
[18113,"GS Wallersheim","Schulstr. 3",54597,"Wallersheim","(06558)393","gs.wallersheim@t-online.de","ö","Udo-van-Meeteren","Grundschule Wallersheim"]
[18126,"GS Wallertheim","Schulstr. 6",55578,"Wallertheim","(06732)7594","info@gs-wallertheim.de","ö","Grundschule Wallertheim"]
[18160,"GS Wassenach","Zehntgasse 16",56653,"Wassenach","02636/9664362","gswassenach@brohltal-schulen.de","ö","Grundschule Wassenach"]
[18173,"GS Wehr","Kellerei 2",56653,"Wehr","(02636)7030","gswehr@brohltal-schulen.de","ö","Grundschule Wehr"]
[18186,"GS Weibern","Schulstr. 3",56745,"Weibern","(02655)1313","gsweibern@brohltal-schulen.de","ö","Grundschule Weibern"]
[18190,"GS Weiler/Bingen","Heilig-Kreuz-Weg 3",55413,"Weiler","06721-32875","info@gs-heiligkreuz.bildung-rp.de","ö","Grundschule Heilig Kreuz"]
[18203,"GS Weiler Vordereifel","Schulstraße 1",56729,"Weiler","(02656)2149050","grundschuleweiler@gmx.de","ö","Grundschule Weiler","Eifel"]
[18220,"GS Weinsheim","Schulstraße 26",55595,"Weinsheim","(06758)6600","grundschule@weinsheim.de","ö","Grundschule Weinsheim"]
[18246,"GS Mainz-Weisenau Schiller","Portlandstr. 26",55130,"Mainz","(06131)833298","schule.gs-schiller@stadt.mainz.de","ö","Schillerschule","Grundschule Weisenau"]
[18250,"GS Weißenthurm","Breslauer Straße 1",56575,"Weißenthurm","(02637)2792","schulleitung@grundschule-weissenthurm.de","ö","Grundschule Weißenthurm"]
[18263,"GS Weitefeld","Schulstraße 3",57586,"Weitefeld","(02743)6310","buero@grundschule-weitefeld.de","ö","Grundschule Weitefeld"]
[18280,"GS Welling","Mayener Straße 12",56753,"Welling","(02654)1475","gswelling@web.de","ö","Grundschule Welling"]
[18293,"GS Welschbillig","Mühlenstr. 9",54298,"Welschbillig","(06506)443","gs-welschbillig@online.de","ö","Grundschule Welschbillig"]
[18306,"GS Appenheim","Kloppgasse 24",55437,"Appenheim","(06725)2699","sekretariat@gs-appenheim.de","ö","Grundschule Welzbachtal"]
[18310,"GS Wershofen","Hauptstr. 42",53520,"Wershofen","(02694)1344","Grundschule.Wershofen@T-Online.de","ö","Herzog-Ludwig-Engelbert-Schule","Grundschule"]
[18323,"GS Westheim","Schulstr. 1",67368,"Westheim","(06344)1758","info@gs-westheim.de","ö","Grundschule Westheim"]
[18336,"GS Wiesbach","Schulstr. 38",66894,"Wiesbach","(06337)8243","gs-wiesbach@vgzwland.de","ö","Carl-Orff-Grundschule"]
[18340,"GS Wilgartswiesen","Schulstr. 25",76848,"Wilgartswiesen","(06392)1524","gs.wilgartswiesen@web.de","ö","Grundschule","Wilgartswiesen"]
[18353,"GS Wiltingen","Rosenbergstr. 130 c",54459,"Wiltingen",650116126,"gswiltingen@konz.de","ö","Grundschule St. Martin"]
[18396,"GS Windhagen","Reinhard-Wirtgen-Str. 8",53578,"Windhagen","(02645)4926","info@gs-windhagen.de","ö","Erich Kästner-Schule","Grundschule"]
[18426,"GS Wintrich","Schulstr. 11",54487,"Wintrich","(06534)8326","info@gs-wintrich.bildung-rp.de","ö","Grundschule Wintrich"]
[18443,"GS Wissen","Schulstr. 12",57537,"Wissen","(02742)2921","verwaltung@fgwissen.de","ö","Franziskus-Grundschule","Grundschule"]
[18460,"GS Wittgert","Schulstraße 38",56237,"Wittgert","(02623)2216","GS-Haiderbach@web.de","ö","Grundschule Haiderbach"]
[18473,"GS Wittlich Meistermann","Lieserstraße 12",54516,"Wittlich","(06571)2528","info@gm-grundschule.de","ö","Georg-Meistermann-Grundschule"]
[18486,"GS Wittlich-Friedrichstr.","Friedrichstraße 14",54516,"Wittlich","(06571)5119","info@grundschule-wittlich.de","ö","Grundschule Friedrichstraße"]
[18499,"GS Wittlich-Bombogen","Berlinger Str. 1",54516,"Wittlich","(06571)26181","gs-bombogen@web.de","ö","Grundschule Bombogen"]
[18503,"GS Wittlich-Wengerohr","Schulstraße 1",54516,"Wittlich","(06571)6011","info@gs-wengerohr.de","ö","Grundschule Wengerohr"]
[18516,"GS Wörth Damm","Königstr. 1",76744,"Wörth am Rhein","(07271)131540","gs-dammschule@woerth.de","ö","Dammschule","Grundschule"]
[18520,"GS Wolfstein","Im Tauchental 18",67752,"Wolfstein","(06304)4169280","grundschulewolfstein@t-online.de","ö","Grundschule Am Königsberg"]
[18533,"GS Landau Wollmesheimer-Höhe","Barbarossastr. 4",76829,"Landau in der Pfalz","(06341)134470","GS-Wollmesheim@Landau.de","ö","Grundschule Wollmesheimer-Höhe"]
[18546,"GS Worms Heppenheim","Kirchhofplatz 9-13",67551,"Worms","(06241)33050","Wiesengrund-GS@worms.de","ö","Wiesengrundschule","Grundschule Heppenheim"]
[18550,"GS Worms Dalberg","Höhenstr. 19",67550,"Worms","(06241)51925","dalbergschule@freenet.de","ö","Dalbergschule","Grundschule Herrnsheim"]
[18563,"GS Worms Wiesoppenheim","Losengewann 32",67551,"Worms","(06241)935492","wiesoppenheim-gs@worms.de","ö","Grundschule Wiesoppenheim"]
[18576,"GS Zeiskam","Hauptstraße 16",67378,"Zeiskam","(06347)2839","gs.zeiskam@vg-bellheim.de","ö","Fuchsbach Grundschule Zeiskam"]
[18589,"GS Zell","Plänterstraße 42",56856,"Zell","(06542)901537","verwaltung@grundschule-zell.eu","ö","Grundschule Zell"]
[18606,"GS Zornheim","Hahnheimer Str. 16",55270,"Zornheim","(06136)44165","sekretariat@grundschule-zornheim.de","ö","Grundschule Zornheim"]
[18610,"GS Zweibrücken Albert-Schweitzer","Ernstweilertalstr. 11",66482,"Zweibrücken","(06332)903169","gs-albert-schweitzer-schule@schule-zw.de","ö","Albert-Schweitzer-Schule","Grundschule"]
[18623,"GS Zweibrücken-Bubenhausen","Allensteinstr. 25",66482,"Zweibrücken","(06332)903167","gs-breitwiesenschule@schule-zw.de","ö","Breitwiesenschule","Grundschule Bubenhausen"]
[18636,"GS Zweibrücken Hilgard","Ackerweg 9",66482,"Zweibrücken","(06332)450501","gs-hilgardschule@schule-zw.de","ö","Hilgard-Grundschule"]
[18640,"GS Zweibrücken-Ixheim","Thomas-Mann-Str. 60",66482,"Zweibrücken","(06332)903232","gs-thomas-mann-schule@schule-zw.de","ö","Grundschule Ixheim"]
[18653,"GS Zweibrücken-Mittelbach","Breitensteinstr. 32",66482,"Zweibrücken","(06332)905641","gs-mittelbach@schule-zw.de","ö","Grundschule Mittelbach"]
[18679,"GS Zweibrücken Pestalozzi","Himmelsbergstr. 27",66482,"Zweibrücken","(06332)209750","gs-pestalozzischule@schule-zw.de","ö","Pestalozzi-Grundschule"]
[18683,"GS Zweibrücken-Rimschweiler","Alleeweg 9",66482,"Zweibrücken","(06332)75277","gs-rimschweiler@schule-zw.de","ö","Grundschule Rimschweiler"]
[18696,"GS Zweibrücken Sechsmorgen","Am Otterstein 14",66482,"Zweibrücken","(06332)450500","gs-sechsmorgen@schule-zw.de","ö","Grundschule Sechsmorgen"]
[18713,"GS Frankenthal Erkenbert","Lilienstr. 10",67227,"Frankenthal","(06233)27513","erkenbertschule@web.de","ö","Erkenbert-Grundschule"]
[18726,"GS Mainz Dr. M. L. King","John-F.-Kennedy-Str. 7",55122,"Mainz","(06131)373181","schule.dr-martin-luther-king@stadt.mainz","ö","Dr. Martin-Luther-King-Schule","Grundschule"]
[18730,"GS Mainz Leibniz","Leibniz-Str. 13",55118,"Mainz","(06131)961644","schule.leibniz@stadt.mainz.de","ö","Leibniz-Schule","Grundschule"]
[18743,"GS Neuwied Marien","Langendorfer Str. 165",56564,"Neuwied","(02631)23654","marienschule@schulen-neuwied.de","ö","Marienschule","Grundschule"]
[18756,"GS Siershahn","Overbergstr. 20",56427,"Siershahn","(02623)6074780","info@grundschule-siershahn.de","ö","Grundschule Siershahn"]
[18786,"GS Hochstadt","Schulstraße 16",76879,"Hochstadt","(06347)1531","schulleitung@hainbachschule.de","ö","Hainbachschule","Grundschule"]
[18799,"GS Neustadt Hans-Geiger","Hans-Geiger-Str. 21",67434,"Neustadt","06321-487922","gs-hans-geiger@schulen.neustadt.eu","ö","Hans-Geiger-Schule","Grundschule"]
[18803,"GS Idar-Oberstein Idarbachtal","Alte Poststr. 59",55743,"Idar-Oberstein","(06781)64740","gs-idarbachtal@idar-oberstein.de","ö","Grundschule","Idarbachtal"]
[18893,"GS Frankenthal Pestalozzi","Vierlingstr. 12",67227,"Frankenthal","(06233)220452","pestalozzischule.ft@web.de","ö","Pestalozzi-Schule","Grundschule"]
[19255,"GS Dolgesheim","Gartenfeldstraße 17",55278,"Dolgesheim","(06733)487","schulleitung@gag-dolgesheim.de","ö","Grundschule am Gartenfeld"]
[19345,"GS Gerolstein","Waldstraße 15",54568,"Gerolstein","(06591)3372","info@grundschule-gerolstein.de","ö","Grundschule Gerolstein"]
[19674,"GS Lambrecht","Schulstr. 7",67466,"Lambrecht","(06325)8227","info@grundschule-lambrecht.de","ö","Grundschule Lambrecht"]
[19721,"GS Mainz-Gonsenheim","Gleisbergweg 50",55122,"Mainz","(06131)690600","schule.am-gleisberg@stadt.mainz.de","ö","Grundschule","Am Gleisberg - Gonsenheim"]
[20407,"GS Niederfell","Schulstr. 4",56332,"Niederfell","(02607)4169","gs-niederfell@t-online.de","ö","Grundschule","Papst Johannes XXIII"]
[20467,"GS Worms Karmeliter","Karmeliterstr. 3",67547,"Worms","(06241)26353","karmeliter@gmx.de","ö","Karmeliter-Schule","Grundschule"]
[20470,"GS Trier am Dom","Dominikaner Str. 5",54290,"Trier","(0651)7105-8310","grundschule-am-dom@bistum-trier.de","p","Grundschule am Dom","GTS mit musikal. Schwerpunkt"]
[20500,"GS Bitburg St. Matthias","Prümer Straße 18",54634,"Bitburg","(06561)949010","grundschule-st-matthias@bistum-trier.de","p","Bischöfliche Grundschule","St. Matthias"]
[20513,"GS Worms Kerschensteiner","Neubachstr. 57",67551,"Worms","(06241)8534830","kerschensteiner.gs@gmx.de","ö","Grundschule Kerschensteiner"]
[20543,"GS Trier Keune","Am Weidengraben 33",54296,"Trier","(0651)12384","info@keune-gs.de","ö","Keune-Grundschule"]
[20557,"GS Worms Abenheim","Von-Ketteler-Straße 15",67550,"Worms","(06242)3731","klausenbergschule@gmx.de","ö","Klausenbergschule","Grundschule Abenheim"]
[20617,"GS Kaisersesch","Im Haag 5",56759,"Kaisersesch","(02653)8911","grundschule.kaisersesch@kaisersesch.de","ö","Kurfürst-Balduin-Schule","Grundschule"]
[20633,"GS Dannstadt-Schauernheim","Kurpfalzstraße 2",67125,"Dannstadt-Schauernheim","06231-941840","info@gs-kurpfalzschule.de","ö","Kurpfalzschule","Grundschule"]
[20647,"GS Alzey Albert-Schweitzer","Donnersbergstr. 32",55232,"Alzey","(06731)3193","gsassalzey@gmx.de","ö","Albert-Schweitzer-Schule","Grundschule"]
[20676,"GS Neuwied Margareten","Schulstraße 10",56566,"Neuwied","(02622)82810","margaretenschule@neuwied.de","ö","Margaretenschule","Grundschule"]
[20680,"GS Neuwied-Heimbach-Weis","Sayner Straße 3",56566,"Neuwied","(02622)81216","maria-goretti-schule@schulen-neuwied.de","ö","Maria-Goretti-Schule","Grundschule Heimbach-Weis"]
[20693,"GS Bad Hönningen","Rudolf-Buse-Straße 4",53557,"Bad Hönningen","(02635)3566","sekretariat@grundschule-bad-hoenningen.d","ö","Grundschule Bad Hönningen"]
[20707,"GS Idar-Oberstein Idar","Pestalozzistraße 2",55743,"Idar-Oberstein","06781-64730","gs-idar@idar-oberstein.de","ö","Grundschule","Idar"]
[20710,"GS Trier Martin","Peter-Friedhofen-Str. 48",54292,"Trier","(0651)26797","info@martin-grundschule.de","ö","Martin-Grundschule"]
[20723,"GS Mainz Martinus","Breite Straße 2",55124,"Mainz",null,null,"p","Martinus-Schule","Private Grundschule Gonsenheim"]
[20737,"GS Mainz-Oberstadt Martinus","Generaloberst-Beck-Str. 9",55129,"Mainz","(06131)95300-0","martinusschule@mso.bildung-rp.de","p","Martinusschule","Private Grundschule Oberstadt"]
[20753,"GS Mainz-Weisenau Martinus","Heinrich-Schrohe-Str. 10",55130,"Mainz","(06131)839207","sekretariat@martinus-schule-weisenau.bil","p","Martinusschule","Private Grundschule Weisenau"]
[20766,"GS Trier Matthias","Kentenichstr. 2-4",54290,"Trier","(0651)30625","info@matthias-grundschule.de","ö","Matthias-Grundschule"]
[20783,"GS Hillscheid","Waldstraße 21",56204,"Hillscheid","(02624)3321","post@gs-hillscheid.de","ö","Melchiades-Best-Schule","Grundschule"]
[20830,"GS Winnweiler","Schulstr. 19 a",67722,"Winnweiler","(06302)2731","info@grundschule-winnweiler.de","ö","Maria-Montessori-Grundschule"]
[20856,"GHS Pirmasens","Klosterstraße 1-3",66953,"Pirmasens","(06331)722152","schulleitung@nardinihaus.de","p","Private Grund- und Hauptschule","des Nardinihauses"]
[20860,"GS Worms Neusatz","Willy-Brandt-Ring 5",67547,"Worms","(06241)23866","neusatz-gs@web.de","ö","Grundschule Neusatz"]
[20873,"GS Neuwied Sonnenland","Sonnenstr. 46",56564,"Neuwied","(02631)24045","sonnenlandschule@schulen-neuwied.de","ö","Sonnenlandschule","Grundschule"]
[20886,"GS Alzey Nibelungen","Nibelungenstr. 14",55232,"Alzey",null,"GS.Nibelungenschule@alzey.de","ö","Nibelungenschule","Grundschule"]
[20903,"GS Worms Ernst-Ludwig","Gießenstraße 5",67547,"Worms","(06241)6340","sekretariat@els-worms.de","ö","Ernst-Ludwig-Schule","Grundschule"]
[20946,"GS Worms-Pfeddersheim","Grabenstr. 50",67551,"Worms","(06247)7337","verwaltung@paternusschule.de","ö","Paternus-Schule Pfeddersheim","Grundschule"]
[20963,"GS Eisenberg","Schulstraße 12",67304,"Eisenberg","(06351)122520","info@gseisenberg.de","ö","Grundschule Eisenberg"]
[20980,"GS Worms Pestalozzi","Bensheimer Str. 45",67547,"Worms","(06241)44844","pestalozzischule@gmx.net","ö","Pestalozzi-Schule","Grundschule"]
[21008,"GS Bruttig-Fankel","Birkenweg 16",56814,"Bruttig-Fankel","(02671)8664","petrus-mosellanus@gs-bruttig-fankel.bild","ö","Petrus-Mosellanus-Schule","Grundschule"]
[21011,"GS Dernbach","Hilchenstraße 14",56428,"Dernbach","(02602)91917-0","info@grundschule-dernbach.de","ö","Grundschule Dernbach","Pfarrer-Giesendorf-Schule"]
[21037,"GS Frankenthal Schuman","Ziegelhofweg 16",67227,"Frankenthal","(06233)64819","rsg@igs-frankenthal.de","ö","Robert-Schuman-Grundschule"]
[21072,"GS Fußgönheim","Schulstraße 24",67136,"Fußgönheim","(06237)2693","grundschule@fussgoenheim.de","ö","Schillerschule","Grundschule"]
[21085,"GS Lahnstein Schiller","Schillerstraße 1a",56112,"Lahnstein","(02621)9680-0","schillerschule@lahnstein.de","ö","Schillerschule","Grundschule"]
[21101,"GS Bottenbach","Schulstraße 15",66504,"Bottenbach","06339/7455","info@grundschule-bottenbach.de","ö","Grundschule Bottenbach"]
[21114,"GS Osthofen","Memelstr. 2",67574,"Osthofen","(06242)80990-60","info@seebachschule.de","ö","Seebachschule","Grundschule"]
[21127,"GS Mudersbach","Am Erlenwald 31",57555,"Mudersbach","(0271)353768","gsmudersbach@t-online.de","ö","Martin-Luther-Schule","GS Niederschelderhütte"]
[21131,"GS Brachbach","Konrad-Adenauer-Straße 1",57555,"Brachbach","(02745)405","gs.brachbach@gmail.com","ö","Petrus-Canisius-Schule","Grundschule"]
[21175,"GS Gemünden/Hunsrück","Soonwaldstr. 3",55490,"Gemünden","(06765)325","t.koenig@soonwaldschule-gemuenden.de","ö","Soonwaldschule","Grundschule"]
[21188,"GS Alzey St.Marien","Schulgässchen 7",55232,"Alzey","(06731)6749","sekretariat@marien-schule-alzey.de","p","Private Grundschule St. Marien"]
[21204,"GS Ellenz-Poltersdorf","Schulstr. 32",56821,"Ellenz-Poltersdorf","(02673)1670","schule@gs-ellenz-poltersdorf.bildung-rp.","ö","St. Sebastianus-Schule","Grundschule"]
[21217,"GS Bad Bodendorf","Schulstr. 30",53489,"Sinzig","(02642)41780","grundschule@bad-bodendorf.de","ö","Grundschule Bad Bodendorf"]
[21234,"GS Worms Staudinger","Kurfürstenstraße 20",67549,"Worms","(06241)52067","staudinger-gs@schulen-worms.de","ö","Staudinger-Grundschule Worms"]
[21278,"GS Bad Dürkheim Ostertag","Eduard-Jost-Straße 24",67098,"Bad Dürkheim","(06322)980695","vos@bad-duerkheim.de","ö","Valentin-Ostertag-Schule","Grundschule"]
[21355,"GS Dohr","Hauptstraße 1c",56812,"Dohr","(02671)7177","gs.dohr@gs-dohr.bildung-rp.de","ö","Grundschule Cochem-Dohr"]
[21372,"GS Hambuch","Schulstr. 2a",56761,"Hambuch","(02653)1409","grundschule.hambuch-gamlen@kaisersesch.d","ö","Grundschule Hambuch-Gamlen"]
[21432,"GS Erbes-Büdesheim","Nackerstr. 22",55234,"Erbes-Büdesheim",6731908321,"info@gs-eb.de","ö","Grundschule Erbes-Büdesheim"]
[21458,"GS Reichenbach-Steegen","Schulstraße 9",66879,"Reichenbach-Steegen","(06385)335","gsreichenbach@web.de","ö","Grundschule Reichenbach-","Steegen"]
[21578,"GS Arzbach","Wiesenweg 22",56337,"Arzbach","(02603)8268","limesschule@t-online.de","ö","Grundschule Limesschule","Arzbach"]
[21642,"GS Brohl","Schulstr. 8",56754,"Brohl","(02672)8272","gs-forster-kirchspiel@kaisersesch.de","ö","Grundschule Forster Kirchspiel"]
[21702,"GS Brey","Schulstraße 1a",56321,"Brey","(02628)2268","info@grundschule-brey.de","ö","Rheingoldschule","Grundschule Brey"]
[21758,"GS Carlsberg","Lindenstraße 45",67316,"Carlsberg","(06356)989175","Sekretariat@gs-carlsberg.de","ö","Grundschule am Atzenberg"]
[21851,"GS Edesheim","Ruprechtstr. 6",67483,"Edesheim","(06323)981531","schulleitung@gs-edesheim.de","ö","Grundschule Edesheim"]
[21938,"GS Freinsheim","Haintorstraße 27",67251,"Freinsheim","(06353)4209","grundschule-freinsheim@vg-freinsheim.de","ö","Hermann-Sinsheimer-Grundschule"]
[21955,"GS Obere Grafschaft","Grünstr. 9",53501,"Grafschaft",null,null,"ö","Grundschule Obere Grafschaft","Gelsdorf"]
[22062,"GS Heimersheim","Vehner Weg 31",53474,"Bad Neuenahr-Ahrweiler","(02641)25375","sekretariat@gs-heimersheim.bildung-rp.de","ö","Grundschule an der Landskrone"]
[22119,"GS Hettenleidelheim","Hauptstr. 27",67310,"Hettenleidelheim",63518191,"gsh@22119.bildung-rp.de","ö","Luitpoldschule","Grundschule"]
[22136,"GS Hilgert","Bergstraße 24",56206,"Hilgert","(02624)7423","schulleitung@sonnenfeldschule.de","ö","Sonnenfeld-Grundschule"]
[22166,"GS Hof","Schul- und Sportzentrum 6",56472,"Hof","(02661)5693","info@grundschule-hof.de","ö","Grundschule Hof"]
[22239,"GS Insheim","Hauptstr. 17",76865,"Insheim","(06341)4997","Grundschule-Insheim@t-online.de","ö","Grundschule Insheim"]
[22392,"GS Koblenz-Rübenach","Am Mühlenteich 15",56072,"Koblenz","(0261)24329","sekretariat@gsruebenach.bildung.koblenz.","ö","Grundschule Rübenach"]
[22449,"GS Kruft","Alte Chaussee 34",56642,"Kruft","(02652)6778","grundschule-kruft@t-online.de","ö","Grundschule Kruft"]
[22482,"GS Grafschaft Leimersdorf","An der Arche 10",53501,"Grafschaft","(02641)27336","Grundschule-Leimersdorf@web.de","ö","Grundschule An der Arche","Grafschaft Leimersdorf"]
[22495,"GS Leubsdorf","Auf dem Kreuzberg 1",53547,"Leubsdorf","(02644)5742","grundschule@leubsdorf.de","ö","Grundschule St. Walburgis"]
[22509,"GS Lieg","Schulstr. 9",56290,"Lieg","(02672)1830","wendelinus@gs-lieg.bildung-rp.de","ö","Wendelinus-Grundschule"]
[22556,"GS Lutzerath","Schulstr. 2",56826,"Lutzerath","(02677)422","RGS.Vulkaneifel@t-online.de","ö","Grundschule Lutzerath"]
[22569,"GS Mackenbach","Marktstr. 16",67686,"Mackenbach","(06374)6617","info@mackenbach-grundschule.de","ö","Grundschule Mackenbach"]
[22572,"GS Maßweiler","Schulstr. 28",66506,"Maßweiler","(06334)1337","gs-massweiler@vgtw.de","ö","Grundschule Maßweiler"]
[22585,"GS Mauchenheim","Schulstr. 6",67294,"Mauchenheim","06352-4862","sekretariat@grundschule-mauchenheim.de","ö","Grundschule Mauchenheim"]
[22599,"GS Mehring","Peter-Vogt-Straße 1",54346,"Mehring","(06502)2181","gs-mehring@web.de","ö","Grundschule Mehring"]
[22706,"GS Neuhofen","Donnersbergstraße 1",67141,"Neuhofen","(06236)1284","info-gs@neuhofen.de","ö","Rehbachschule","Grundschule"]
[22736,"GS Neuwied-Engers","Orffstraße 22",56566,"Neuwied","(02622)2514","kunostein-grundschule@schulen-neuwied.de","ö","Kunostein-Grundschule","Neuwied-Engers"]
[22749,"GS Nickenich","Kolpingstraße 18",56645,"Nickenich","(02632)81820","grundschule-nickenich@t-online.de","ö","St. Arnulfus-Schule","Grundschule"]
[22826,"GS Nistertal","Am Sportplatz 6",57647,"Nistertal","(02661)40491","gs-nistertal@t-online.de","ö","Grundschule Nistertal"]
[22962,"GS Offenbach","Hauptstr. 84",76877,"Offenbach an der Queich","(06348)959520","sekretariat@grundschule-offenbach.de","ö","Grundschule","Offenbach a. d. Queich"]
[23100,"GS Rieden","Schulstr. 9",56745,"Rieden","(02655)3965","GS-Rieden@gmx.de","ö","Grundschule Rieden"]
[23113,"GS Rieschweiler-Mühlbach","Hohlweg 3",66509,"Rieschweiler-Mühlbach","(06336)993909","gs-ri-mb@vgtw.de","ö","Grundschule Rieschweiler-","Mühlbach"]
[23126,"GS Grafschaft-Ringen","Im Kreuzerfeld 8",53501,"Grafschaft","(02641)28363","Grundschule-Ringen@web.de","ö","Grundschule Grafschaft-Ringen"]
[23156,"GS Rodenbach","Am Keltenplatz 6",67688,"Rodenbach","(06374)1725","info@grundschule-rodenbach.com","ö","Grundschule Rodenbach"]
[23173,"GS Rüdesheim","Schulstraße 21",55593,"Rüdesheim","(0671)28309","info@gsruedesheim.de","ö","Grundschule am Rosengarten"]
[23216,"GS Saffig","Neuwieder Straße 12",56648,"Saffig","(02625)4721","schulleitung@grundschule-saffig.de","ö","Grundschule Saffig"]
[23293,"GS Schwegenheim","Schulstraße 20",67365,"Schwegenheim","(06344)2620","kontakt@gs-schwegenheim.de","ö","Grundschule Schwegenheim"]
[23366,"GS St. Katharinen","Josef-Hüngsberg-Straße 10",53562,"Sankt Katharinen",26453170,"grundschule@st-katharinen.de","ö","St. Georg-Schule","Grundschule"]
[23400,"GS Andernach-Miesenheim","Jahnstr. 22",56626,"Andernach","(02632)71663","GS_St.Kastor-Miesenheim@web.de","ö","Grundschule St. Kastor"]
[23473,"GS Steinfeld","Schulring 14",76889,"Steinfeld","(06340)260","info@gs-steinfeld.bildung-rp.de","ö","Grundschule Steinfeld"]
[23520,"GS Trier Gregor-von-Pfalzel","Pfalzgrafenstr. 49",54293,"Trier","(0651)64907","grundschule-pfalzel@web.de","ö","Gregor-von-Pfalzel-Grundschule"]
[23550,"GS Ulmen","Bahnhofstraße 37",56766,"Ulmen",26768177,"buero@burg-grundschule.de","ö","Burg-Grundschule Ulmen"]
[23563,"GS Unnau","Schwimmbadstraße 32",57648,"Unnau","(02661)64358","GS-Unnau@t-online.de","ö","Grundschule Unnau"]
[23589,"GS Vettelschoß","Willscheider Weg 30",53560,"Vettelschoß","(02645)2633","grundschule@vettelschoss.de","ö","Grundschule am Blauen See"]
[23606,"GS Wattenheim","Hauptstraße 34",67319,"Wattenheim","(06356)417","schulleitung@gs-wattenheim.de","ö","Grundschule Wattenheim"]
[23756,"GS Worms Westend","Von-Steuben-Str. 11",67549,"Worms","(06241)53363","Westend-GS@worms.de","ö","Westend-Schule","Grundschule"]
[23787,"GS Oppenheim","Krämerstr. 38",55276,"Oppenheim","(06133)926015","schulleitung@gs-oppenheim.bildung-rp.de","ö","Grundschule am Gautor"]
[23820,"GS Zemmer","Schulstraße 5",54313,"Zemmer","06580-508","gs-rodt@online.de","ö","Grundschule St. Michael","Zemmer-Rodt"]
[23833,"GS Stadtkyll","Schulstr. 8",54589,"Stadtkyll","(06597)6592010","gs-stadtkyll@gerolstein.de","ö","Grundschule Stadtkyll"]
[23846,"GS Mandern","Schulstr. 2",54429,"Mandern","(06589/613","schulleitung@grundschule-mandern.de","ö","Grundschule Mandern-Waldweiler"]
[23859,"GS Mertesdorf","Hauptstraße 80",54318,"Mertesdorf","(0651)57278","grundschule.mertesdorf@ruwer.de","ö","Grundschule Mertesdorf-Kasel"]
[23864,"GS Plaidt","Schulstr. 5",56637,"Plaidt","(02632)5087","grundschule.plaidt@t-online.de","ö","Grundschule Plaidt"]
[23880,"GS Ahrweiler","Blankartstr. 13",53474,"Bad Neuenahr-Ahrweiler","(02641)3386","info@aloisiusschule.de","ö","Ganztagsgrundschule Ahrweiler","Aloisiusschule"]
[23923,"GS Wirges","Theodor-Heuss-Ring 4",56422,"Wirges","(02602)9494110","info@grundschule-wirges.de","ö","Theodor-Heuss-Schule","Grundschule"]
[23949,"GS Gimbsheim","Goethestraße 7",67578,"Gimbsheim","(06249)5926","schulleitung@gs-gimbsheim.de","ö","Prof. Jakob Muth Grundschule","Grundschule Gimbsheim"]
[23954,"GS Alsheim Sonnenberg","Schulstraße 10",67577,"Alsheim","(06249)8056990","mail@grundschule-alsheim.de","ö","Grundschule am Sonnenberg"]
[23967,"GS Altrip","Albert-Schweitzer-Straße 2",67122,"Altrip","(06236)398082","asg@altrip.de","ö","Albert-Schweitzer-Schule","Grundschule"]
[23997,"GS Gerbach","Wiesenstraße 7",67813,"Gerbach","06361/1303","appeltal-gerbach@bildung-nl.de","ö","Appeltal-Grundschule"]
[24002,"GS Weisenheim am Sand","Westring 24",67256,"Weisenheim am Sand","(06353)8806","gs-was@vg-freinsheim.de","ö","Grundschule Weisenheim am Sand"]
[24015,"GS Schweich","Bodenländchen 2",54338,"Schweich","(06502)5529","info@gs-schweich.de","ö","Grundschule am Bodenländchen","Schweich"]
[24031,"GS Fell","Im Brühl 1",54341,"Fell","(06502)2612","gs-fell@vg-schweich.de","ö","Grundschule St. Barbara"]
[24045,"GS Föhren","Im Brühl 3",54343,"Föhren","(06502)8890","gs-foehren@vg-schweich.de","ö","Grundschule Am Föhrenbach"]
[24058,"GS Klüsserath","Dammstr. 35",54340,"Klüsserath","(06507)4616","gs-kluesserath@vg-schweich.de","ö","Grundschule Klüsserath"]
[24061,"GS Hornbach","Turnhallstraße 1",66500,"Hornbach","(06338)465","gs-hornbach@vgzwland.de","ö","Hieronymus-Bock-Grundschule"]
[24091,"GS Obermoschel","Am Klausengarten 2",67823,"Obermoschel","(06362)8776","GSObermoschel@t-online.de","ö","Grundschule Obermoschel"]
[24105,"GS Münsterappel","Schulstraße 4",67822,"Münsterappel",63628710,"regenbogenschule-muensterappel@bildung-n","ö","Grundschule","Regenbogenschule Münsterappel"]
[24151,"GS Bad Sobernheim","Münchwiesen 41",55566,"Bad Sobernheim","(06751)855590","info@gsbadsobernheim.de","ö","Grundschule Bad Sobernheim"]
[24165,"GS Diez Karl-von-Ibell","Dielstr. 10",65582,"Diez","(06432)5260","info@ibellschule-diez.de","ö","Grundschule Karl-von-Ibell"]
[24178,"GS Diez Pestalozzi","Friedrichstr. 14",65582,"Diez","(06432)61900","pestalozzischulediez@hotmail.com","ö","Grundschule Pestalozzischule"]
[24195,"GS Hahnstätten","Jahnstr. 21",65623,"Hahnstätten","(06430)928296","info@grundschule-hahnstaetten.de","ö","Grundschule Hahnstätten"]
[24211,"GS Birlenbach","Schulstr. 19",65626,"Birlenbach","06432/8600","info@grundschule-birlenbach.de","ö","Grundschule Birlenbach"]
[24225,"GS Boppard-Buchholz","Heidestr. 49",56154,"Boppard","(06742)2923","schulebuchholz@t-online.de","ö","Grundschule Buchholz"]
[24238,"GS Niederneisen","Mühlgasse 4",65629,"Niederneisen","(06432)1367","info@grundschule-niederneisen.de","ö","Grundschule Niederneisen"]
[24241,"GS Welschneudorf","Schulstr. 9",56412,"Welschneudorf","(02608)801","info@gs-welschneudorf.de","ö","Kastanienschule","Grundschule"]
[24268,"GS Marienrachdorf","Theodor-Heuss-Ring 23",56242,"Marienrachdorf","(02626)5565","gsmarienrachdorf@live.de","ö","Grundschule Marienrachdorf"]
[24271,"GS Bettingen","Maximinstr. 3",54646,"Bettingen","(06527)93111","GS-Bettingen@t-online.de","ö","Prümtal-Grundschule"]
[24285,"GS Bickendorf","Ließemer Straße 5",54636,"Bickendorf","(06569)963136","gsbickendorf-seffern@t-online.de","ö","Wilhelm-Busch-Grundschule","Grundschule Bickendorf-Seffern"]
[24298,"GS Rittersdorf","Schulstr. 10",54636,"Rittersdorf","(06561)3955","info@gs-rittersdorf.de","ö","Grundschule St. Barbara Schuls"]
[24315,"GS Dudeldorf","Schulstraße 8",54647,"Dudeldorf","(06565)93066","info@gs-dudeldorf.de","ö","Grundschule Dudeldorf"]
[24328,"GS Wolsfeld","Europastr. 65",54636,"Wolsfeld","(06568)93136","info@gs-wolsfeld.de","ö","Don Bosco-Schule","Grundschule"]
[24375,"GS Weselberg","Hauptstr. 8",66919,"Weselberg","(06333)63172","gs-weselberg@vgtw.de","ö","Grundschule Weselberg"]
[24388,"GS Obernheim-Kirchenarnbach","Schulstr. 26",66919,"Obernheim-Kirchenarnbach","(06371)2809","gs-obki@vgtw.de","ö","Grundschule Obernheim-","Kirchenarnbach"]
[24391,"GS Koblenz-Ehrenbreitstein","Im Teichert 110",56076,"Koblenz","(0261)79730","grundschuleehrenbreitstein@web.de","ö","Grundschule Ehrenbreitstein"]
[24405,"GS Speicher","Schulstr. 2",54662,"Speicher","(06562)3312","info@grundschule-speicher.de","ö","St. Marien Grundschule"]
[24421,"GS Mülheim-Kärlich Kirschblütenschule","Ringstraße 47",56218,"Mülheim-Kärlich","(02630)1755","sekretariat@grundschule-muelheim.de","ö","Grundschule Mülheim-Kärlich","Kirschblütenschule"]
[24435,"GS Mülheim-Kärlich Christophorus","Clemensstr. 2",56218,"Mülheim-Kärlich","(02630)962470","info@grundschule-christophorus.de","ö","Grundschule Christophorus","Grundschule  Mülheim-Kärlich 2"]
[24448,"GS Mülheim-Kärlich St. Peter und Paul","Schulstraße 25",56218,"Mülheim-Kärlich","(02630)7674","info@grundschule-peterpaul.de","ö","Grundschule Mülheim-Kärlich","St. Peter und Paul"]
[24451,"GS Kaltenengers","Raiffeisenstraße 2",56220,"Kaltenengers","(02630)6309","info@pater-wald-grundschule.de","ö","Pater-Wald-Schule","Grundschule"]
[24465,"GS St. Sebastian","Hauptstraße 6",56220,"Sankt Sebastian","(0261)82612","info@Lindenbaum-Grundschule.de","ö","Lindenbaum-Grundschule"]
[24478,"GS Urmitz","Hauptstraße 15",56220,"Urmitz","(02630)7393","info@gs-urmitz.de","ö","Grundschule St. Georg"]
[24508,"GS Koblenz-Immendorf","Schlosshofstr. 32",56077,"Koblenz","(0261)62910","schule@gsimmendorf.bildung-rp.de","ö","St. Christophorus-Schule","Grundschule Immendorf"]
[24511,"GS Koblenz-Arzheim","In der Felsch 15",56077,"Koblenz","(0261)71666","schule@gsarzheim.bildung-rp.de","ö","Grundschule Arzheim"]
[24541,"GS Mittelstrimmig","Schulstraße 39",56858,"Mittelstrimmig","(06545)8946","gsstrimmig@gmx.de","ö","Grundschule Strimmiger Berg"]
[24568,"GS Hatzenbühl","Feigenberg 16",76770,"Hatzenbühl","(07275)5877","mail@gs-hatzenbuehl.de","ö","Grundschule St. Wendelinus"]
[24571,"GS Rheinzabern","Rappengasse 5a",76764,"Rheinzabern","(07272)71050","sekretariat@grundschule-rheinzabern.de","ö","Grundschule Rheinzabern"]
[24584,"GS Jockgrim","Schelmenwaldstraße 3",76751,"Jockgrim","(07271)981141","info@lina-sommer-grundschule.de","ö","Lina-Sommer-Grundschule"]
[24598,"GS Neupotz","Schulstr. 29",76777,"Neupotz","(07272)9725830","mail@gs-neupotz.de","ö","Grundschule Neupotz"]
[24601,"GS Clausen","Schillerstraße 21",66978,"Donsieders","(06333)955547","grundschule@clausen.de","ö","Grundschule Clausen/Donsieders"]
[24615,"GS Münchweiler/Rodalb","Römerstraße 20",66981,"Münchweiler an der Rodalb","(06395)993466","grundschule@muenchweiler-rodalb.de","ö","Schillerschule","Grundschule"]
[24628,"GS Merzalben","Bischof-Emanuel-Straße 13",66978,"Merzalben","(06395)993469","grundschule@merzalben.de","ö","Grundschule Leimen/Merzalben"]
[24631,"GS Remagen-Oberwinter","Pfarrer-Sachsse-Str. 1",53424,"Remagen","(02228)7124","mail@gsoberwinter.de","ö","Grundschule Oberwinter"]
[24645,"GS Remagen St. Martin","Alte Straße 11",53424,"Remagen","(02642)22370","sekretariat@grundschule-remagen.de","ö","Grundschule St. Martin Remagen"]
[24658,"GS Müden","Görresstr. 38",56254,"Müden","(02672)911812","kontakt@gs-mueden.bildung-rp.de","ö","Grundschule Müden"]
[24674,"GS Rengsdorf","Schulstr. 1",56579,"Rengsdorf","(02634)1403","grundschule-rengsdorf@t-online.de","ö","Astrid-Lindgren-Schule","Grundschule"]
[24691,"GS Salmtal","Salmstr. 48",54528,"Salmtal","(06578)7271","schulleitung@gssalmtal.de","ö","Grundschule Salmtal"]
[24721,"GS Beindersheim","Schlittweg 13",67259,"Beindersheim","(06233)72903","info@gs-beindersheim.de","ö","Albrecht-Dürer-Schule","Grundschule"]
[24735,"GS Heßheim","Schulstraße 3",67258,"Heßheim","(06233)70169","info@gs-hessheim.de","ö","Grundschule Heßheim"]
[24748,"GS Weidenthal","Langentalstraße 3",67475,"Weidenthal","(06329)511","info@gs-weidenthal.de","ö","Grundschule Weidenthal"]
[24751,"GS Bad Dürkheim Salier","Wellsring 182",67098,"Bad Dürkheim","(06322)8142","salier@bad-duerkheim.de","ö","Salierschule","Grundschule"]
[24764,"GS Ingelheim Theodor-Heuss","Ludwig-Richter-Str. 7",55218,"Ingelheim am Rhein","(06132)86100","Theodor-Heuss-Schule@ingelheim.de","ö","Theodor-Heuss-Schule","Grundschule"]
[24781,"GS Miehlen","Schulstr. 10",56357,"Miehlen","(06772)7098","gs.miehlen@vg-nastaetten.de","ö","Mühlbachschule","Grundschule"]
[24794,"GS Andernach St. Stephan","Taubentränke 51",56626,"Andernach","(02632)1242","stephanschule_andernach@web.de","ö","Grundschule St. Stephan"]
[24808,"GS Andernach St. Peter","Karolingerstr. 63",56626,"Andernach","(02632)1239","kontakt@st-peter-andernach.de","ö","Grundschule St. Peter"]
[24811,"GS Katzenelnbogen","Burgstr. 4",56368,"Katzenelnbogen",64861663,"sekretariat@gs-einrich.de","ö","Grundschule im Einrich"]
[24841,"GS Neustadt/Wied","Raiffeisenstr. 7",53577,"Neustadt","(02683)3588","schulleitung.grundschule-neustadt@web.de","ö","Grundschule in der Au"]
[24854,"GS Weilerbach","Schulstraße 8",67685,"Weilerbach","(06374)1410","info@gs-weilerbach.de","ö","Grundschule Weilerbach"]
[24868,"GS Dahn","Geschwister-Scholl-Straße 4",66994,"Dahn","(06391)1268","andre.wuenstel@dahner-felsenland.de","ö","Grundschule Dahn"]
[24884,"GS Fischbach/Dahn","Hauptstr. 37",66996,"Fischbach","(06393)1350","grundschule-fischbach@gmx.de","ö","Grundschule Sauertal"]
[24898,"GS Bruchweiler-Bärenbach","Gartenstr. 79",76891,"Bruchweiler-Bärenbach","(06394)9209560","judith.hagenmueller@dahner-felsenland.de","ö","Felsland-Schule","Grundschule"]
[24901,"GS Busenberg","Herrenfeldstraße 2",76891,"Busenberg","(06391)2954","judith.hagenmueller@dahner-felsenland.de","ö","Grundschule St. Georg"]
[24915,"GS Spay","Koblenzer Str. 18 - 20",56322,"Spay","(02628)2013","grundschule@spay.de","ö","Grundschule Spay"]
[24928,"GS Rhens","Schulstraße 4",56321,"Rhens","(02628)8170","info@gs-rhens.de","ö","Grundschule Rhens","Schule am Königsstuhl"]
[24931,"GS Seibersbach","Schulstraße 21",55444,"Seibersbach","06724-3614","GS-Seibersbach@t-online.de","ö","Grundschule","Dörrebach-Seibersbach"]
[24944,"GS Waldfischbach-Burgalben","Philipp-Rothhaar-Straße 17",67714,"Waldfischbach-Burgalben","06333-955192","gswfb@t-online.de","ö","Grundschule Heidelsburg"]
[24958,"GS Lemberg","Schulstr. 5",66969,"Lemberg","(06331)209100","info@schule-lemberg.de","ö","Heinrich-Weber-Schule","Grundschule"]
[24961,"GS Wörrstadt","Obere Schulstr. 16",55286,"Wörrstadt","(06732)7512","info@gs-woerrstadt.de","ö","Neubornschule","Grundschule"]
[24988,"GS Saulheim","Am Kapellenberg 1",55291,"Saulheim","(06732)938460","info@gs-saulheim.de","ö","Grundschule am Mühlbach","Saulheim"]
[24991,"GS Partenheim","Am Sportplatz 2",55288,"Partenheim","(06732)7201","info@gs-partenheim.de","ö","Grundschule Partenheim"]
[25006,"GS Albig","Ardennenstraße 20",55234,"Albig","(06731)7558","GS-Albig@web.de","ö","Grundschule Albig"]
[25019,"GS Alzey-Weinheim","Rathausstr. 36",55232,"Alzey","(06731)41994","gs.weinheim@alzey.de","ö","Grundschule Weinheim"]
[25035,"GS Simmertal","Schulstraße 13",55618,"Simmertal","(06752)135-7200","gs-simera@kirner-land.de","ö","Simera-Grundschule Simmertal"]
[25049,"HS Aach","Auf dem Wehrborn",54298,"Aach","(0651)8244-150","schulleitung@wehrborn.de","p","Cusanus-Hauptschule Aach","Haus auf dem Wehrborn"]
[25065,"GS Dreis","Kirchstraße 21",54518,"Dreis","(06578)7244","schulleitung@gsdreis.de","ö","Grundschule Dreis"]
[25079,"GS Gladbach","Peter-Mergen-Str. 2 A",54518,"Gladbach","(06508)444","gsgladbach@t-online.de","ö","Grundschule Gladbach"]
[25082,"GS Hetzerath","Bahnhofstr. 14",54523,"Hetzerath","(06508)842","schulleitung@gshetzerath.de","ö","Grundschule Hetzerath"]
[25095,"GS Sehlem","Schulstraße 15",54518,"Sehlem","(06508)619","schulleitung@gssehlem.de","ö","Grundschule St. Rochus"]
[25109,"GS Wörth Dorschberg","Zeisigweg 2",76744,"Wörth am Rhein","(07271)131520","gs-dorschberg@woerth.de","ö","Dorschbergschule","Grundschule"]
[25125,"GS Weitersburg","Peter-Friedhofen-Straße 8-10",56191,"Weitersburg","(02622)5243","Peter-Friedhofen-Schule2@t-online.de","ö","Peter-Friedhofen-Grundschule"]
[25139,"GS Urbar","Am Sportplatz 2b",56182,"Urbar","(0261)62582","info@grundschule-urbar.de","ö","Grundschule Urbar"]
[25142,"GS Bendorf Medardus","Ringstr. 115",56170,"Bendorf","(02622)5373","medardus-schule@t-online.de","ö","Grundschule Medardus"]
[25169,"GS Ober-Olm","Schulstraße 4",55270,"Ober-Olm",613689127,"mail@gs-ober-olm.de","ö","Grundschule Ober-Olm"]
[25172,"GS Stadecken-Elsheim","Rupt-Sur-Moselle-Str. 5",55271,"Stadecken-Elsheim","06136-2221","info@adam-elsheimer-grundschule.de","ö","Adam-Elsheimer-Grundschule"]
[25185,"GHS Taben-Rodt","Kirchstraße 1",54441,"Taben-Rodt","(06582)914000","info@localhost","p","Private Grund- und Hauptschule","Propstey St. Josef"]
[25215,"GS Binsfeld","Dudeldorfer Str. 4",54518,"Binsfeld","(06575)4826","schulleitung@gsbinsfeld.de","ö","Grundschule Binsfeld"]
[25262,"GS Neuhäusel","Eitelborner Straße 22",56335,"Neuhäusel","(02620)586","sekretariat@augst-schule.de","ö","Augst-Schule","Grundschule"]
[25292,"GS Niederelbert","Gartenstr. 13",56412,"Niederelbert","(02602)2929","info@gs-niederelbert.de","ö","Grundschule Am Hähnchen"]
[25305,"GS Horbach","Schulstr. 17",56412,"Horbach","(06439)7611","schulleitung@gs-horbach.de","ö","Grundschule im Buchfinkenland"]
[25322,"GS Girod","Schulstr. 17",56412,"Girod","(06485)527","eisenbachtal@grundschule-girod.de","ö","Eisenbachtal-Grundschule"]
[25365,"GS Kröv","Schulweg 1",54536,"Kröv","(06541)6884","Grundschule-Kroev@T-Online.de","ö","Grundschule St. Remigius Kröv"]
[25379,"GS Reil","Schulstr. 19",56861,"Reil","06542-2926","sekretariat@gs-reil.bildung-rp.de","ö","Grundschule Reil"]
[25409,"GS Wallenborn","Schulstraße 9",54570,"Wallenborn","(06599)461","gs.wallenborn@localhost","ö","Grundschule Wallenborn"]
[25412,"GS Dörrenbach","Am Kolmerberg 38-40",76889,"Dörrenbach","(06343)1211","info@grundschule-doerrenbach.de","ö","Grundschule Dörrenbach"]
[25425,"GS Heltersberg","Hauptstr. 1",67716,"Heltersberg","(06333)63973","gsheltersberg@freenet.de","ö","Holzlandschule","Grundschule"]
[25442,"GS Herschbach/ Uww.","Herrenheeg 2",56249,"Herschbach","(02626)453","GSHerschbach@gmx.de","ö","Grundschule Herschbach/Uww."]
[25455,"GS Neumagen-Dhron","Willemsstr. 55",54347,"Neumagen-Dhron","(06507)2615","info@sthelenags.bildung-rp.de","ö","St. Helena-Grundschule"]
[25469,"GS Kaden","Elberbütz 14",56459,"Kaden","(02663)6817","info@gs-kaden.de","ö","Grundschule Kaden"]
[25472,"GS Thaleischweiler-Fröschen","Grieshohlstr. 15",66987,"Thaleischweiler-Fröschen","(06334)5162","gs-thaleischweiler@vgtw.de","ö","Grundschule Thaleischweiler-","Fröschen"]
[25498,"GS Otterbach","Ziegelhütterstr. 12",67731,"Otterbach",63011299,"gs.otterbach@otterbach-otterberg.de","ö","Goetheschule","Grundschule"]
[25502,"GS Olsbrücken","Hauptstr. 56",67737,"Olsbrücken","06308-1247","gs.olsbruecken@otterbach-otterberg.de","ö","Grundschule Olsbrücken"]
[25515,"GS Katzweiler","Schulstr. 6",67734,"Katzweiler",null,null,"ö","Grundschule Katzweiler"]
[25529,"GS Bendorf Bodelschwingh","Am Röttchenshammer 16",56170,"Bendorf","(02622)10282","sekretariat@bodelinos.bildung-rp.de","ö","Grundschule Bodelschwingh"]
[25559,"GS Emmelshausen","Rhein-Mosel-Str. 85",56281,"Emmelshausen","(06747)95395011","grundschule@gsemmelshausen.de","ö","Konrad-Adenauer-Schule","Grundschule"]
[25592,"GS Dieblich","Kirchstraße 32",56332,"Dieblich","(02607)4133","dieblich@gsrheinmosel.de","ö","Grundschule Dieblich"]
[25605,"GS Lehmen","Bergstr. 19",56332,"Lehmen","(02607)255","lehmen@gsrheinmosel.de","ö","Grundschule Lehmen"]
[25619,"GS Oberfell","Schulstraße 4",56332,"Oberfell","(02605)2244","oberfell@gsrheinmosel.de","ö","Grundschule Oberfell"]
[25622,"GS Winningen","Marktstr. 57",56333,"Winningen","(02606)404","winningen@gsrheinmosel.de","ö","Astrid-Lindgren-Grundschule"]
[25649,"GS Höhn","Zehntgrafstr. 12",56462,"Höhn","(02661)98660","info@gs-hoehn.de","ö","Grundschule Höhn"]
[25652,"GS Landau Pestalozzi","Langstr. 9a",76829,"Landau in der Pfalz","(06341)134462","sekretariat-pestalozzischule@landau.de","ö","Pestalozzischule","Grundschule"]
[25665,"GS Stockum-Püschen","Zum Heckelchen 4",56459,"Stockum-Püschen","(02661)40285","info@gs-stockum-pueschen.de","ö","Grundschule Stockum-Püschen","Stöffelmaus-Schule"]
[25678,"GS Limburgerhof Carl-Bosch","Carl-Bosch-Straße 9",67117,"Limburgerhof","(06236)465536","gs-cbs@carl-bosch-schule.de","ö","Carl-Bosch-Schule","Grundschule"]
[25695,"GS Annweiler","Schulstraße 9",76855,"Annweiler am Trifels","(06346)7244","schulleitung@gsannweiler.de","ö","Grundschule Annweiler"]
[25712,"GS Kaiserslautern Paul-Münch","Augustastr. 7-9",67655,"Kaiserslautern","(0631)4145057","paul-muench-gs@web.de","ö","Paul-Münch-Schule","Grundschule"]
[25725,"GS Kuhardt","Schulstraße 7",76773,"Kuhardt","(07272)2717","info@grundschule-kuhardt.de","ö","Grundschule Kuhardt"]
[25739,"GS Hördt","Kirchstr. 7",76771,"Hördt","(07272)71001","info@grundschule-hoerdt.de","ö","Grundschule Hördt"]
[25742,"GS Leimersheim","Abraham-Weil-Straße 2a",76774,"Leimersheim",72722687,"info@grundschule-leimersheim.de","ö","Kardinal-Wendel-Schule","Grundschule"]
[25755,"GS Albersweiler","Auf der Lehr 1",76857,"Albersweiler","(06345)1648","grundschulealbersweiler@web.de","ö","Grundschule Albersweiler"]
[25768,"GS Gossersweiler-Stein","Kastanienweg 2",76857,"Gossersweiler-Stein","(06346)5401","gs-gossersweiler@annweiler.rlp.de","ö","Grundschule Gossersweiler-","Stein"]
[25772,"GS Ramberg","Dekan-Schill-Str. 1 a",76857,"Ramberg","(06345)-8325","gsramberg@t-online.de","ö","Grundschule Ramberg"]
[25785,"GS Brücken/Birkenfeld","Schulstr. 12",55767,"Brücken","(06782)5377","schulleitung-gs-bruecken@gmx.de","ö","Grundschule Brücken"]
[25798,"GS Hennweiler","Schulstraße 26",55619,"Hennweiler","(06752)1357300","gs-luetzelsoon@kirner-land.de","ö","Lützelsoonschule","Grundschule"]
[25802,"GS Hoppstädten-Weiersbach","Schulstr. 13",55768,"Hoppstädten-Weiersbach","(06782)2566","gs-hoppstaedten@t-online.de","ö","Grundschule Hoppstädten-","Weiersbach"]
[25832,"GS Schifferstadt Nord","Rehbachstraße 11",67105,"Schifferstadt","(06235)497990","kontakt@gs-nord-schifferstadt.de","ö","Grundschule Nord"]
[25862,"GS Altrich","Schulstr. 3",54518,"Altrich","(06571)20286","sl@gsaltrich.de","ö","Grundschule Altrich"]
[25875,"GS Altleiningen","Hauptstraße 50",67317,"Altleiningen","(06356)8539","sekretariat@gs-altleiningen.de","ö","Grundschule","am 20-Röhren-Brunnen"]
[25888,"GS Bockenheim","Pestalozzistraße 10",67278,"Bockenheim an der Weinstraße","(06359)4111","gs.bockenheim@gmail.com","ö","Jakob Böshenz-Schule","Grundschule"]
[25892,"GS Dirmstein","Bahnhofstraße 7",67246,"Dirmstein","(06238)2028","sekretariat@grundschule-dirmstein.de","ö","Grundschule Dirmstein"]
[25905,"GS Obrigheim","Gasseweg 17",67283,"Obrigheim","(06359)3679","Sonnenberg@grundschule-obrigheim.de","ö","Grundschule am Sonnenberg"]
[25922,"GS Idar-Oberstein Auf der Bein","Auf der Bein 5",55743,"Idar-Oberstein","06781/64770","gs-aufderbein@idar-oberstein.de","ö","Grundschule","Auf der Bein"]
[25948,"GS Fischbach","Hauptstr. 36",55743,"Fischbach","06784/2544","info@grundschule-fischbach.de","ö","Grundschule Fischbach"]
[25952,"GS Oberreidenbach","Hauptstr. 25",55758,"Oberreidenbach","(06788)7131","GS-Reidenbachtal@web.de","ö","Grundschule Reidenbachtal"]
[25978,"GS Nierstein","Ernst-Ludwig-Str. 22",55283,"Nierstein","(06133)4914500","schulleitung@grundschule-nierstein.de","ö","Grundschule Nierstein"]
[25982,"GS Hahnheim","Bahnhofstr. 68",55278,"Hahnheim","(06737)1313","schulleitung@gs-am-selzbogen.de","ö","Grundschule Am Selzbogen"]
[25995,"GS Pfeffelbach","Kirchenstr. 4",66871,"Pfeffelbach","(06384)444","Grundschule.Pfeffelbach@web.de","ö","Grundschule Pfeffelbach"]
[26000,"GS Worms-Rheindürkheim","Schulstr. 2",67550,"Worms","(06242)7272","gs.rheinduerkheim@gmx.de","ö","Grundschule Rheindürkheim"]
[26026,"GS Pfaffen-Schwabenheim","Badenheimer Straße 52",55546,"Pfaffen-Schwabenheim","(06701)404","info@gs-pf.de","ö","Grundschule Pfaffen-Schwabenhe"]
[26039,"GS Friesenhagen","Klosterstr. 7",51598,"Friesenhagen","(02734)7376","gs.friesenhagen@gmail.com","ö","St. Franziskus Grundschule"]
[26043,"GS Trierweiler","Schulstr. 15",54311,"Trierweiler","(0651)88426","gs-trierweiler@online.de","ö","Grundschule Trierweiler"]
[26056,"GS Niederahr","Oststr. 17",56414,"Niederahr","(02602)69611","ahrbach@gmx.de","ö","Ahrbach-Grundschule"]
[26069,"GS Boppard-Bad Salzig","Wiltbergerstraße 7",56154,"Boppard","(06742)6108","gs-bad-salzig@gmx.de","ö","Grundschule Bad Salzig"]
[26074,"GS Kordel","Friedhofstraße 29",54306,"Kordel","(06505)450","gs-kordel@online.de","ö","Grundschule Kordel"]
[26087,"GS Ruppach-Goldhausen","Schulstraße 25b",56412,"Ruppach-Goldhausen","(02602)8759","schulleitung@gs-am-ahrbach.de","ö","Grundschule am Ahrbach"]
[26090,"GS Montabaur Waldschule","Buchenstr. 52",56410,"Montabaur","(02602)3188","schulleitung@waldschule-montabaur.de","ö","Waldschule Horressen","Grundschule"]
[26103,"GS Lörzweiler","Schlossstraße 13a",55296,"Lörzweiler","(06138)980800","rektor-loerzweiler@vg-bodenheim.de","ö","Grundschule Am Alten Schloss","Grundschule Lörzweiler"]
[26116,"GS Montabaur Kehrein","Gelbachstr. 1",56410,"Montabaur","(02602)4555","sekretariat@jks-montabaur.de","ö","Joseph-Kehrein-Schule","Grundschule"]
[26134,"GS Betzdorf Martin-Luther","Schützenstraße 62",57518,"Betzdorf","(02741)910710","gsbetzdorf1@gmx.de","ö","Martin-Luther-Schule","Grundschule"]
[26147,"GS Betzdorf Christophorus","Johannes-Krell-Str. 17",57518,"Betzdorf","(02741)910730","christophorus.betzdorf@gmail.com","ö","Christophorus-Schule","Grundschule"]
[26150,"GS Burgen","Schulstr. 48",56332,"Burgen","(02605)4252","Burgen@gsrheinmosel.de","ö","Grundschule Burgen"]
[26163,"GS Nassau","Windener Str. 21",56377,"Nassau","02604-4700","gsnassau@vgben.de","ö","Freiherr-vom-Stein-Schule","Grundschule"]
[26180,"GS Koblenz-Schenkendorf","Schenkendorfstr. 15",56068,"Koblenz","(0261)31218","schulleitung@gsschenkendorf.bildung.kobl","ö","Grundschule Schenkendorf"]
[26207,"GS Guckheim","Schulstr. 12",56459,"Guckheim","(06435)2761","info@gs-guckheim.de","ö","Brüder-Grimm-Schule","Grundschule"]
[26210,"GS Langenhahn","Kapellenweg 10",56459,"Langenhahn","(02663)6005","info@gs-langenhahn.de","ö","Sonnental-Grundschule","Langenhahn"]
[26224,"GS Schweppenhausen","Naheweinstraße 5a",55444,"Schweppenhausen","(06724)3886","GS.Schweppenhausen@t-online.de","ö","Grundschule Schweppenhausen"]
[26237,"GS Singhofen","Schulstraße 16",56379,"Singhofen","02604-4777","gssinghofen@vgben.de","ö","Grundschule \"Am Windrad\""]
[26240,"GS Nister-Möhrendorf","Schulstraße 1",56477,"Nister-Möhrendorf","(02667)1440","GSHoherWW@gmx.de","ö","Grundschule Hoher Westerwald"]
[26267,"GS Mertloch","Schulstr. 2",56753,"Mertloch","(02654)7134","schulleitung.gs.me@maifeld.de","ö","Grundschule","St. Martin"]
[26270,"GS Herschweiler-Pettersheim","Am Sportplatz 10",66909,"Herschweiler-Pettersheim","(06384)51460810","info@grundschule-hp.de","ö","Herzog-Christian-Schule","Grundschule"]
[26283,"GS Böbingen","In den Feldern 1",67482,"Böbingen","(06327)2237","sekretariat@gaeuschule.eu","ö","Grundschule Gäuschule","Böbingen-Gommersheim"]
[26297,"GS Trier-Ruwer","Franz-Altenhofen-Str. 1",54292,"Trier","(0651)52264","gs.trier-ruwer@gmx.de","ö","Grundschule Ruwer"]
[26300,"GS Lustadt","Schulstraße 5",67363,"Lustadt","(06347)973040","kontakt@gs-lustadt.de","ö","Grundschule Lustadt"]
[26314,"GS Jettenbach","Austraße 25",66887,"Jettenbach","(06385)415288","schulleitung@gs-jettenbach.de","ö","Grundschule Königsland"]
[26327,"GS Altenkirchen FEBA","Heinestraße 5",57610,"Altenkirchen","(02681)3909","s.velten@feba-ak.de","p","Freie Ev. Bekenntnisschule","Grundschule"]
[26330,"GS Kottenheim","Schulstr. 17",56736,"Kottenheim","(02651)700590","schulleitung@gs-kottenheim.bildung-rp.de","ö","Grundschule Kottenheim"]
[26343,"GS Ettringen","Neue Schulstraße 15",56729,"Ettringen","(02651)7469976","gs-ettringen@gmx.de","ö","Grundschule Ettringen"]
[26357,"GS Dernau","Klosterstraße 101",53507,"Dernau","(02643)1551","gs-dernau@altenahr.de","ö","Grundschule Dernau"]
[26360,"GS Billigheim-Ingenheim","Mühlhofener Str. 39",76831,"Billigheim-Ingenheim","(06349)929503","klingbachschule@klingbachschule.de","ö","Klingbachschule","Grundschule"]
[26373,"GS Mettendorf","Hangenbach 9",54675,"Mettendorf","(06522)920300","gshildegardis@web.de","ö","Grundschule","Hildegardis"]
[26404,"GS Meudt","Alter Kirchweg 2",56414,"Meudt","(06435)8645","grundschule.meudt@gmx.de","ö","Adolf-Reichwein-Grundschule"]
[26417,"GS Hundsangen","Günterstr. 13",56414,"Hundsangen","(06435)961137","gshundsangen@gmx.de","ö","Erich Kästner-Grundschule"]
[26420,"GS Weroth","Hundsänger Str. 1",56414,"Weroth","(06435)1066","gs-weroth@gmx.de","ö","Linden-Grundschule Weroth","LGS Weroth"]
[26447,"GS Kallstadt","Weinstraße 79",67169,"Kallstadt","(06322)1881","Sekretariat-GSKallstadt@vg-freinsheim.de","ö","Grundschule Kallstadt"]
[26450,"GS Kobern-Gondorf","Lennigstraße 16",56330,"Kobern-Gondorf","(02607)555","kobern-gondorf@gsrheinmosel.de","ö","Grundschule an der Niederburg","Kobern-Gondorf"]
[26477,"GS Westerburg","Breslauer Str. 1",56457,"Westerburg","(02663)2609","info@gs-westerburg.de","ö","Regenbogenschule","Grundschule"]
[26493,"GS Kyllburg","Bademerstr. 76",54655,"Kyllburg","(06563)96750","info@gs-kyllburg.de","ö","Grundschule Kyllburg"]
[26537,"GS Burgbrohl","Greimerstalweg 19",56659,"Burgbrohl","(02636)2056","gsburgbrohl@brohltal-schulen.de","ö","Grundschule Burgbrohl"]
[26540,"GS Kirn Hellberg","Königsberger Straße 80",55606,"Kirn","06752/135-7000","hellbergschule@kirn.de","ö","Hellberg-Schule","Grundschule"]
[26553,"GS Kirn Dominik","Dhauner Str. 41",55606,"Kirn","(06752)1357100","dominikschule@kirn.de","ö","Dominikschule","Grundschule"]
[26570,"GS Wallmerod","Molsbergerstr. 9",56414,"Wallmerod","(06435)6029","gswallmerod@gmx.de","ö","Grundschule am Eichberg"]
[26583,"GS Kempfeld","Wildenburgstraße 11",55758,"Kempfeld","(06786)1766","GSWildenburg@gmx.de","ö","Grundschule Wildenburg"]
[26630,"GS Simmern/Hunsrück Schöllhammer","Am Flachsberg 4",55469,"Simmern","06761-970287","buero@gs-schoelles.de","ö","Dr.-Kurt-Schöllhammer-Schule","Grundschule"]
[26643,"GS Nentershausen","Aarstr. 11",56412,"Nentershausen","(06485)91087","schule@gs-nentershausen.de","ö","Pfarrer-Toni-Sode-Grundschule"]
[26657,"GS Dellfeld","Schulstr. 48",66503,"Dellfeld","(06336)341","gs-dellfeld@vgzwland.de","ö","Grundschule Dellfeld"]
[26660,"GS Elsoff","Dörner Straße 19",56479,"Elsoff","(02664)5160","Info@Lasterbachschule-Elsoff.de","ö","Lasterbachschule","Grundschule"]
[26673,"GS Mastershausen","Kirchstraße 8a",56869,"Mastershausen","(06545)910100","schulleitung@gsmastershausen.de","ö","Grundschule Mastershausen"]
[26687,"GS Nastätten","Wilhelm-Nesen-Str. 2a",56355,"Nastätten","(06772)9670420","gs.nastaetten@vg-nastaetten.de","ö","Grundschule Blaues Ländchen"]
[26690,"GS Elmstein","Feldpfad 2",67471,"Elmstein","(06328)1500","schule@localhost","ö","Heinrich-Weintz-Schule","Grundschule"]
[26703,"GS Waxweiler","Schulstr. 10a",54649,"Waxweiler","(06554)666","info@gs-waxweiler.de","ö","Grundschule","Waxweiler"]
[26717,"GS Pfalzfeld","Schulstraße 1",56291,"Pfalzfeld","(06746)9225","sekretariat@gspfalzfeld.de","ö","Grundschule Pfalzfeld"]
[26720,"GS Neuwied Heddesdorfer Berg","Ludwig-Erhard-Str. 14",56564,"Neuwied","(02631)950700","gs-heddesdorfer-berg@schulen-neuwied.de","ö","Grundschule Heddesdorfer Berg"]
[26733,"GS Speyer Vogelgesang","Kardinal-Wendel-Straße 7",67346,"Speyer","(06232)141730","schule@gsimvogelgesang.de","ö","Grundschule im Vogelgesang"]
[26747,"GS Dahlheim","Am Sportplatz 12",56348,"Dahlheim","(06771)94160","info@guggenmos-schule.de","ö","Josef-Guggenmos-Grundschule"]
[26750,"GS Selters","Jahnstraße 16-20",56242,"Selters","(02626)920100","schulleitung@grundschule-selters.de","ö","Oberwaldschule","Grundschule"]
[26777,"GS Andernach Hasenfänger","Kurt-Schumacher-Str. 107",56626,"Andernach","(02632)300707","info@gs-hasenfaenger.de","ö","Grundschule Hasenfänger"]
[26780,"GS Göllheim","Jahnstr. 1",67307,"Göllheim","(06351)122570","gsg@vg-goellheim.de","ö","Schule am Königspfad","Grundschule"]
[26793,"GS Asbach am Frankenwall","Schulstr. 7",53567,"Asbach","(02683)948562","GS_Asbach@t-online.de","ö","Grundschule am Frankenwall"]
[26810,"GS Zeltingen-Rachtig","Sankt-Florentiner-Str. 8",54492,"Zeltingen-Rachtig","(06532)933131","schule@gszr.bildung-rp.de","ö","Grundschule Zeltingen-Rachtig"]
[26823,"GS Mainz Bretzenheim-Süd","Küferweg 53",55128,"Mainz","(06131)363828","schule.bretzenheim-sued@stadt.mainz.de","ö","Erich Kästner Schule","Grundschule Bretzenheim-Süd"]
[26837,"GS Wachenheim","Hinterm Graben 3",67157,"Wachenheim","06322/66074","schulleitung@gsadwabu.bildung-rp.de","ö","Grundschule Wachenheim"]
[26840,"GS Grünstadt-Sausenheim","Krummlandweg 1",67269,"Grünstadt","(06359)209573","info@gs-sausenheim.de","ö","Grundschule III Grünstadt","Schule am Ritterstein Sausenh."]
[26870,"GS Wincheringen","Helfanter Str. 15",54457,"Wincheringen","(06583)230","schulleitung@grundschule-wincheringen.de","ö","Grundschule","Wincheringen"]
[26883,"GS Altenahr","Altenahrer Straße 11",53501,"Grafschaft","(02643)901859","gs-altenahr@altenahr.de","ö","Grundschule Altenahr"]
[26900,"GS Landau Süd","Raimund-Huber-Str. 14",76829,"Landau in der Pfalz","(06341)134482","gs-sued@landau.de","ö","Grundschule Süd"]
[26930,"GS Mainz-Finthen","Layenhofstraße 26",55126,"Mainz","06131-475764","schule.finthen@stadt.mainz.de","ö","Peter-Härtling-Schule","Grundschule Finthen"]
[26943,"GS Oberdiebach","Schulstraße 19",55413,"Oberdiebach","(06743)2603","gs-petersackerhof@web.de","ö","Grundschule","Petersackerhof"]
[26957,"GS Waldböckelheim","Schulstr. 6",55596,"Waldböckelheim","(06758)7912","gswaldboeckelheim.sl@freenet.de","ö","Grundschule Waldböckelheim"]
[26960,"GS Bockenau Wingertsberg","Zum Felseneck 2",55595,"Bockenau","(06758)372","info@gsbockenau.bildung-rp.de","ö","Grundschule am Wingertsberg","Bockenau"]
[26986,"GS Rheinbrohl","Ruth-Dany-Weg 6",56598,"Rheinbrohl","(02635)922766","info@grundschule-rheinbrohl.de","ö","Astrid-Lindgren-Schule","Grundschule"]
[26990,"GS Nauort","Am Hofacker 6",56237,"Nauort","(02601)606","info@grundschule-nauort.de","ö","Grundschule Nauort"]
[27005,"GS Neuwied FCSN","Nodhausener Str. 35",56567,"Neuwied","02631-957000","info@fcsn.de","p","Freie Christliche Schule","Grundschule"]
[27021,"GS Osburg","Schulstr. 16",54317,"Osburg","(06500)288","grundschule.osburg@ruwer.de","ö","Grundschule Osburg"]
[27048,"GS Ludwigshafen Lukas","Bliesstraße 1",67059,"Ludwigshafen am Rhein","0621-9534207-0","schulleitung@lukas-schule.com","p","LUKAS-Schule","Freie christliche Grundschule"]
[27051,"GS Eich","Schulstraße 2",67575,"Eich","(06246)906790","grundschule.eich@vg-eich.de","ö","Altrheingrundschule Eich"]
[27065,"GS Wöllstein","Eleonorenstr. 83",55597,"Wöllstein","(06703)301425","grundschule@gs-woellstein.de","ö","Grundschule Wöllstein"]
[27078,"GS Dudenhofen","Iggelheimer Str. 33",67373,"Dudenhofen","(06232)900545","info@gs-dudenhofen.de","ö","Clemens Beck Schule","Grundschule"]
[27081,"GS Bobenheim-Roxheim Pestalozzi","Grünstadter Straße 6a",67240,"Bobenheim-Roxheim","(06239)997584","gsestalozzi@bobenheim-roxheim.de","ö","Pestalozzischule","Grundschule"]
[27111,"GS Stromberg","Schulstraße 2",55442,"Stromberg","(06724)1322","kontakt@grundschule-stromberg.de","ö","Drei-Burgen-Grundschule","Stromberg"]
[27138,"GS Lingenfeld","Humboldtstr. 5",67360,"Lingenfeld","(06344)969670","kontakt@gs-lingenfeld.de","ö","Grundschule Lingenfeld"]
[27171,"GS Römerberg-Berghausen","Gutenbergstraße 15",67354,"Römerberg","(06232)815673","info@gs-berghausen.de","ö","Grundschule Berghausen"]
[27184,"GS Düngenheim","St.-Martin-Straße 33",56761,"Düngenheim","[02653]598-270","stmartin@stmartin-dku.de","p","Grundschule St. Martin"]
[27201,"GS Speyer Reform","Herdstraße 5",67346,"Speyer","06232-296983","sekretariat@reformschule-speyer.de","p","Freie Reformschule Speyer","Grundschule"]
[27215,"GS Mogendorf","Töpferstr. 7",56424,"Mogendorf",{"$f":"492623/929503","v":0.52998537928333744},"info@gsmogendorf.de","p","Evangelische Grundschule","Mogendorf und Nordhofen"]
[27231,"GS Germersheim Scholl","Römerweg 2",76726,"Germersheim","07274/702594","grundschule.germersheim@t-online.de","ö","Geschwister-Scholl-Schule","Grundschule"]
[27245,"GS Bad Dürkheim Montessori","Eduard-Jost-Str. 24",67098,"Bad Dürkheim","(06322)9414940","schulleitung@localhost","p","Maria-Montessori-Schule","Bad Dürkheim"]
[27258,"GS Hermersberg-Höheinöd","Schulstraße 44",66919,"Hermersberg","(06333)63444","gs-sickingen@gmx.de","ö","Sickingerhöh-Grundschule","Hermersberg-Höheinöd"]
[27261,"GS Pirmasens Montessori","Roland-Betsch-Str. 1",66954,"Pirmasens","(06331)8080960","kontakt@montessori-pirmasens.de","p","Montessori-Schule Pirmasens"]
[27274,"GS Weisenheim am Berg","Neumayerstraße 27",67273,"Weisenheim am Berg","(06353)507824","gs-wab@vg-freinsheim.de","ö","Grundschule Weisenheim a. B."]
[27288,"GS Alsenz","Am Sportfeld 4",67821,"Alsenz","(06362)993085","nordpfalz-grundschule@bildung-nl.de","ö","Nordpfalz-Grundschule Alsenz"]
[27321,"GS Waldbreitbach","In der Au 38",56588,"Waldbreitbach","(02638)4250","info@gs-waldbreitbach.de","ö","Grundschule","Waldbreitbach"]
[27335,"GS Wallhalben","Schulstr. 13",66917,"Wallhalben","(06375)277","mail@gs-wallhalben.de","ö","Grundschule","Wallhalben"]
[27351,"GS Waldmohr","Bahnhofstr. 57 b",66914,"Waldmohr",63738920604,"sekretariat@grundschule-waldmohr.de","ö","Grundschule","Waldmohr"]
[27364,"GS Speyer St. Magdalena","Hasenpfuhlstraße 32",67346,"Speyer","06232-6781908","st.magd.sp@t-online.de","p","Klosterschule","St. Magdalena Speyer"]
[27378,"GS Heßheim Michael-Sattler","Flomersheimer Straße 1c",67258,"Heßheim","(06233)3558870","info@michael-sattler-schule.de","p","Michael-Sattler-Schule","Priv. Grundschule Heßheim"]
[27381,"GS Worms Montessori","Brückenstraße 2",67551,"Worms","06247/3460360","info@monte-worms.de","p","Freie Montessori Schule Worms"]
[27394,"GS Blankenrath","Waldstraße 4",56865,"Blankenrath","(06545)91217100","sekretariat@gs-blankenrath.de","ö","Grundschule Blankenrath"]
[27408,"GS Kirchheim-Kleinkarlbach","Kleinkarlbacher Straße 2",67281,"Kirchheim an der Weinstraße","(06359)3650","gskirchheim@gmx.de","ö","Grundschule","Kirchheim-Kleinkarlbach"]
[27411,"GS Zerf","Schulstr. 1-3",54314,"Zerf","(06587)99060","Schulleitung@grundschule-zerf.de","ö","Grundschule","Zerf"]
[27425,"GS Mendig Montessori","Bahnstraße 27",56743,"Mendig",26187670943,"info@sonnenschein-montessori.schule","p","Grundschule Mendig Montessori"]
[27441,"GS Glan-Münchweiler","Glanstraße 9",66907,"Glan-Münchweiler",null,"sekretariat@glantalschule.de","ö","Grundschule Glan-Münchweiler","Glantalschule"]
[27454,"GS Wallhausen","Cremerstraße 4",55595,"Wallhausen",null,null,"ö","Geschwister-Scholl-Schule","Grundschule Wallhausen"]
[27468,"GS Bitburg Montessori","Maria-Kundenreich-Straße 4",54634,"Bitburg",null,null,"p","Freie Montessori-Schule","Bitburg-Prüm"]
[27471,"GS Dierdorf Lukas","Heidestraße 50",56269,"Dierdorf",null,null,"p","Lukas-Grundschule","Dierdorf"]
[27484,"GS Völkersweiler/Lug","Mühlstraße 16",76848,"Lug",null,null,"p","Freie Bauernhof-Waldschule","Südpfalz"]
[27498,"GS Kandel Naturschule","Birkenstraße 22",76870,"Kandel",null,null,"p","Freie Naturschule","Kandel"]
[27904,"GS Landau Montessori","Dörrenbergstraße 1",76829,"Landau in der Pfalz","(06341)945481","sekretariat@montessori-landau.de","p","Freie Montessori-Grundschule"]
[30019,"SFGLS Frankenthal","Holzhofstr. 21",67227,"Frankenthal","(06233)49090","info@pih.bv-pfalz.de","ö","Augustin-Violet-Schule","SFGLS Frankenthal"]
[30049,"SFG Speyer","Kardinal-Wendel-Straße 9",67346,"Speyer","(06232)141770","sekretariat@JHP-SP.bildung-rp.de","ö","Johann-Heinrich-Pestalozzi","Schule - SFG Speyer"]
[30052,"SFG Ludwigshafen","Rheinhorststr. 34/36",67071,"Ludwigshafen am Rhein","(0621)504401210","schulleitung@georgens-schule.de","ö","Georgens-Schule","SFG Ludwigshafen"]
[30065,"SFG Herxheim","Bussereaustraße 21",76863,"Herxheim bei Landau/ Pfalz","07276-970-140","St.Laurentius-Schule@cbs-speyer.de","p","St. Laurentius-Schule","Caritas Förderzentrum"]
[30082,"SFGM Meisenheim","Talweg 16",55590,"Meisenheim","(06753)10298","bos-meisenheim@kreuznacherdiakonie.de","p","Stiftung Kreuznacher Diakonie","Bodelschwingh Schule (SFGM)"]
[30095,"SFE Landau","Queichheimer Hauptstraße 231",76829,"Landau in der Pfalz","(06341)9841300","schulleitung.jrs@jugendwerk-st-josef.de","p","Jakob-Reeb-Schule","SFE Landau"]
[30109,"SFM Bad Kreuznach","Waldemarstraße 4",55543,"Bad Kreuznach","(0671)6053352","bes@kreuznacherdiakonie.de","p","Bethesda Schule","SFM Bad Kreuznach"]
[30139,"SFL Trier St. Josef","Schöndorfer Straße 2",54292,"Trier","(0651)28421","foerderschule-st-josef@bistum-trier.de","p","Bischöfliche Förderschule","SFL Trier"]
[30142,"SFGM Wirges","Theodor-Heuss-Ring 6",56422,"Wirges","(02602)6340","info@kkswirges.de","p","Katharina-Kasper-Schule","SFGSFM(G) Wirges"]
[30155,"SFLG Höhr-Grenzhausen","Rathausstr. 131",56203,"Höhr-Grenzhausen","(02624)95440","Verwaltung@Schiller-Schule-HG.de","ö","Schiller-Schule","SFLG Höhr-Grenzhausen"]
[30172,"SFL Westerburg","Königsberger Straße 12a",56457,"Westerburg","(02663)94350","info@fssweb.de","ö","Friedrich-Schweitzer-Schule","SFL Westerburg"]
[30185,"SFBLS Neuwied","Feldkircher Str. 100",56567,"Neuwied","02631970-0","blindenschule-neuwied@lbs-neuwied.lsjv.r","ö","Landesschule für Blinde und","Sehbehinderte - Förderschule"]
[30199,"SFGLS Neuwied","Elisabethstr. 48",56564,"Neuwied","(02631)3426-0","zentrale@lgs-neuwied.lsjv.rlp.de","ö","Landesschule für Gehörlose und","Schwerhörige - Förderschule"]
[30202,"SFGLS Trier","Am Trimmelter Hof 201",54296,"Trier","(0651)910350","whc-schule@whcs.lsjv.rlp.de","ö","Wilhelm-Hubert-Cüppers-Schule","SFGLS Trier"]
[30229,"SFE Neuwied","Heimstraße 41",56566,"Neuwied","(02631)40132","sekretariat@paulschneiderschule.de","p","Paul-Schneider-Schule","SFE Neuwied"]
[30245,"SFG Mainz","Gleisbergweg 48",55122,"Mainz","(06131)49950-30","schule.peter-jordan@stadt.mainz.de","ö","Peter-Jordan-Schule","SFG Mainz"]
[30289,"SFE Altleiningen","Schloßmühle 1",67317,"Altleiningen","(06356)96367100","iris.wiedmann@cbs-speyer.de","p","Schule St. Rafael","SFE Altleiningen"]
[30305,"SFGM Wittlich","Franziskusstraße 1",54516,"Wittlich",6571695107,null,"p","Maria-Grünewald-Schule","SFG / SFM Wittlich"]
[30322,"SFGM Niederfell","Markstr. 62",56332,"Niederfell","(02607)69176","schule@herz-jesu-haus.de","p","Herz-Jesu-Haus Kühr","SFGSFM Niederfell"]
[30335,"SFG Bad Dürkheim","Sägmühle 4",67098,"Bad Dürkheim","(06322)938290","s.welsch-staub@scs-lebenshilfe-duew.de","p","Siegmund-Crämer-Schule","SFG Bad Dürkheim"]
[30352,"SFGM Zweibrücken","Schulacker 12",66482,"Zweibrücken","(06332)8707-0","pbruckner@gemeinschaftswerk.de","p","Mauritius-Schule","SFGSFM Zweibrücken"]
[30379,"SFM Neuwied","Neuwieder Str. 21b",56566,"Neuwied","(02622)892-2680","christiane-herzog-schule@heinrich-haus.d","p","Christiane-Herzog-Schule","SFM Neuwied"]
[30382,"SFGM Dohr","Hauptstraße 1b",56812,"Dohr","02671/987110","info@sfgm-dohr.de","ö","Astrid-Lindgren-Schule","SFG/SFM Dohr"]
[30395,"SFGM Idar-Oberstein","Auf Weißborr 15",55743,"Idar-Oberstein","(06781)27842","Peter_Caesar_Schule@hotmail.com","ö","Peter-Caesar-Schule","SFG/SFM Idar-Oberstein"]
[30409,"SFG Koblenz","Lehrhohl 44",56077,"Koblenz","(0261)79851","Schule-am-Bienhorntal@t-online.de","ö","Schule am Bienhorntal","SFG Koblenz"]
[30439,"SFGM Mayen","Genovevastr. 48",56727,"Mayen","(02651)900513","info@genoveva-schule.de","ö","Genoveva-Schule","SFGM Mayen"]
[30442,"SFG Neuwied","Orffstr. 37",56566,"Neuwied","(02622)9749260","sekretariat@cos-neuwied.de","ö","Carl-Orff-Schule","SFG Neuwied"]
[30455,"SFGM Kastellaun","Theodor-Heuss-Str. 8",56288,"Kastellaun","06762-8551","katharina.kujanek@ths-kastellaun.de","ö","Theodor-Heuss-Schule","SFGSFM Kastellaun"]
[30469,"SFGM Bitburg","Kölner Straße 14",54634,"Bitburg","(06561)96140","info@martin-schule.de","ö","St. Martin-Schule","SFGSFM Bitburg"]
[30472,"SFG Schweich","Bernhard-Becker-Straße 6",54338,"Schweich","(06502)930920","info@levana-schule-schweich.de","ö","Levana-Schule","SFG Schweich"]
[30485,"SFGS Kaiserslautern","Velmannstr. 13",67657,"Kaiserslautern","(0631)3654941","schuleambeilstein@kaiserslautern.de","ö","Schule am Beilstein","SFGSFS Kaiserslautern"]
[30498,"SFG Pirmasens","Heinrich-Kimmle-Weg 4",66953,"Pirmasens",null,null,"p","Pirminiusschule","SFG Pirmasens"]
[30515,"SFG Grünstadt","Westring 62",67269,"Grünstadt","(06359)2777","info@hanszulligersfg.bildung-rp.de","ö","Hans-Zulliger-Schule","SFG Grünstadt"]
[30532,"SFG Kusel","Hollerstraße 4",66869,"Kusel","(06381)42864200","sekretariat@paulmoor-kusel.de","ö","Paul-Moor-Förderschule","SFG Kusel"]
[30559,"SFG Sprendlingen","Stettiner Str. 3",55576,"Sprendlingen","(06701)200750","kontakt@elisabethenschulesprendlingen.co","ö","Elisabethen-Schule","SFG Sprendlingen"]
[30562,"SFM Landau","Queichheimer Hauptstr. 235",76829,"Landau in der Pfalz",null,null,"p","Caritas Förderzentrum St.","Laurentius und Paulus Schule"]
[30575,"SFMG Landstuhl","Langwiedener Straße 12",66849,"Landstuhl","(06371)934263","sekretariat-schule-rw@gemeinschaftswerk.","p","Förderschule","SFMG Landstuhl"]
[30593,"SFL Koblenz II","Brenderweg 23",56070,"Koblenz","(0261)9635810","info@fszulliger.bildung.koblenz.de","ö","Hans-Zulliger-Schule","SFL Koblenz II"]
[30605,"SFL Sinzig","Beethovenstr. 3",53489,"Sinzig","(02642)9790-0","info@jks-sinzig.de","ö","Janusz-Korczak-Schule","SFL Sinzig"]
[30622,"SFLG Burgbrohl","Burgweg 6",56659,"Burgbrohl","(02636)929590","post@burgweg-schule.de","ö","Burgweg-Schule","SFL/G Burgbrohl"]
[30649,"SFL Bad Kreuznach","Ellerbachstr. 17",55545,"Bad Kreuznach","0671/2984450","info@ellerbachschule.de","ö","Schule am Ellerbach","SFL Bad Kreuznach"]
[30652,"SFL Kirn","Berliner Platz 1",55606,"Kirn","(06752)2046","info@wds-kirn.de","ö","Wilhelm-Dröscher-Schule","SFL Kirn"]
[30665,"SFL Schloßböckelheim","Schulstraße 2",55596,"Schloßböckelheim","(06758)1345","verwaltung@burgschule.info","ö","Burgschule","SFL Schloßböckelheim"]
[30683,"SFL Birkenfeld","Brechkaul 14",55765,"Birkenfeld","(06782)2188","info@sfl-birkenfeld.de","ö","Förderschule","SFL Birkenfeld"]
[30709,"SFL Kaisersesch","Im Haag 0",56759,"Kaisersesch","(02653)6631","buero@pommerbachschule.de","ö","Pommerbachschule","SFL Kaisersesch"]
[30725,"SFL Andernach","Taubentränke 51",56626,"Andernach","(02632)987470-0","elisabethschule.andernach@esa.bildung-rp","ö","Elisabethschule","SFL Andernach"]
[30742,"SFL Mayen","St.-Veit-Str. 3",56727,"Mayen","(02651)900516","sekretariat@elisabeth-schule-mayen.de","ö","Elisabeth-Schule","SFL Mayen"]
[30755,"SFL Polch","Ackerstr. 2-4",56751,"Polch","(02654)8817750","stephanus-schule@t-online.de","ö","Stephanus-Schule","SFL Polch"]
[30768,"SFL Bendorf","Engerser Str. 33",56170,"Bendorf","(02622)904980","theodor-heuss-schule.bendorf@rz-online.d","ö","Theodor-Heuss-Schule","SFL Bendorf"]
[30786,"SFL AsbachWW","Laurentiusstraße 1",53567,"Asbach","02683-940500","sekretariat@ass.bildung-rp.de","ö","Albert-Schweitzer-Schule","SFL Asbach"]
[30799,"SFLG Rheinbrohl","Arienhellerstr. 43",56598,"Rheinbrohl",2635911030,"info@maximilian-kolbe-schule.org","ö","Maximilian-Kolbe-Schule","SFL/G Rheinbrohl"]
[30802,"SFL Neuwied","Beverwijker Ring 5",56564,"Neuwied","(02631)96600","sekretariat@kinzing-schule.de","ö","Kinzing-Schule","SFL Neuwied"]
[30815,"SFLG Raubach","Schulstraße 5",56316,"Raubach","(02684)950600","sfl.raubach@web.de","ö","Gustav-W.-Heinemann-Schule","SFL/G Raubach"]
[30829,"SFL Bad Marienberg","Erlenweg 4a",56470,"Bad Marienberg","(02661)91080","michael-ende-schule.bad-mbg@t-online.de","ö","Michael-Ende-Schule","SFL Bad Marienberg"]
[30832,"SFLE Hachenburg","Leipziger Str. 10",57627,"Hachenburg","(02662)7771","Burggartenschule@t-online.de","ö","Burggarten-Schule","SFLSFE Hachenburg"]
[30845,"SFLE Simmern","Herzog-Reichard-Straße 9",55469,"Simmern","(06761)91618-0","Hunsrueckschule@localhost","ö","Hunsrückschule","SFL/SFE Simmern"]
[30858,"SFL Lahnstein","Gymnasialstr. 8",56112,"Lahnstein","(02621)92170","schule@fvss-lahnstein.de","ö","Freiherr-vom-Stein-Schule","SFL Lahnstein"]
[30863,"SFL Nastätten","Schulstr. 18",56355,"Nastätten","(06772)1707","verwaltung@taunus-schule.de","ö","Taunusschule","SFL Nastätten"]
[30876,"SFLS Schweich","Isseler Straße 37",54338,"Schweich","(06502)910950","info@meulenwald-schule.de","ö","Meulenwald-Schule","SFL/SFS Schweich"]
[30889,"SFL Bernkastel-Kues","Bornwiese 12",54470,"Bernkastel-Kues","(06531)3939","verwaltung@bls-bks.de","ö","Burg-Landshut-Schule","SFL Bernkastel-Kues"]
[30893,"SFLS Wittlich","Petrusstraße 28",54516,"Wittlich","(06571)91570","verwaltung@liesertal-schule.de","ö","Liesertal-Schule","SFL/SFS Wittlich"]
[30905,"FöZ Daun","Schulstraße 5",54550,"Daun","(06592)980113","info@foerderzentrum-daun.de","ö","St. Laurentius-Schule","Förderzentrum"]
[30922,"SFLS Reinsfeld","Schulstraße 1",54421,"Reinsfeld","(06503)7606","martinus.schule@t-online.de","ö","St. Martinus-Schule","SFL/SFS Reinsfeld"]
[30948,"SFL Frankenthal","Wormser Str. 59",67227,"Frankenthal",6233220439,"kontakt@fbz-frankenthal.de","ö","Albert-Schweitzer-Schule","SFL Frankenthal"]
[30953,"SFL Landau","Nordring 4",76829,"Landau in der Pfalz","(06341)83102","info@nordringschule.de","ö","Nordringschule","SFL Landau"]
[30979,"SFL Mainz","Generaloberst-Beck-Str. 1",55129,"Mainz","06131-53966","schule.windmuehlen@stadt.mainz.de","ö","Windmühlenschule","SFL Mainz"]
[30983,"SFL Neustadt","Wiesenstr. 17",67433,"Neustadt","(06321)921841","foes-schubert@schulen.neustadt.eu","ö","Schubert-Schule","SFL Neustadt"]
[30996,"SFL Speyer","Im Erlich 67 A",67346,"Speyer","06232/141760","schulleitung@schuleimerlich.de","ö","Schule im Erlich"]
[31001,"FöZ Worms","Elisabeth-Groß-Platz 1",67547,"Worms","06241-88329","foerderzentrum@schulen-worms.de","ö","Geschwister-Scholl-Schule","Förderzentrum"]
[31014,"SFL Bad Dürkheim","Friedelsheimer Straße 18",67098,"Bad Dürkheim","(06322)947272","limburgschule@t-online.de","ö","Limburgschule","SFL Bad Dürkheim"]
[31027,"SFL Haßloch","Meckenheimer Str. 10",67454,"Haßloch","(06324)2121","gottliebwenzschule@t-online.de","ö","Gottlieb-Wenz-Schule (SFL)","& Förder- u. Beratungszentrum"]
[31030,"SFLS Kirchheimbolanden","Dannenfelser Str. 29",67292,"Kirchheimbolanden","(06352)1262","sekretariat@mhs-kibo.de","ö","Mathilde-Hitzfeld-Schule","SFSL Kirchheimbolanden"]
[31057,"SFLGMS Rockenhausen","Mühlackerweg 25a",67806,"Rockenhausen","(06361)5562","SchuleamDonnersberg@web.de","ö","Förderschule","SFLGMS Rockenhausen"]
[31087,"SFL Landstuhl","Neugasse 2",66849,"Landstuhl","(06371)618160","sekretariat@jakob-weber-schule.de","ö","Jakob-Weber-Schule","SFL Landstuhl"]
[31090,"SFLS Kusel","Hollerstraße 2",66869,"Kusel","(06381)42864-100","sekretariat@jakob-muth-schule.de","ö","Jakob-Muth-Schule","SFLS Kusel"]
[31117,"SFL Annweiler","Herrenteich 2",76855,"Annweiler am Trifels","(06346)965120","foerderschule.annweiler@gmx.de","ö","SFL Annweiler","im Staufer-Schulzentrum"]
[31120,"SFL Schifferstadt","Jägerstraße 18",67105,"Schifferstadt","06235/49049","info@salierschule-schifferstadt.de","ö","Salierschule","SFL Schifferstadt"]
[31134,"SFLS Bingen","Burgstr. 17",55411,"Bingen am Rhein","(06721)408780","info@rhein-nahe-schule.de","ö","Rhein-Nahe-Schule","SFLS Bingen"]
[31147,"SFL Ingelheim","Talstr. 153",55218,"Ingelheim am Rhein","(06132)4354710","ASS.Ingelheim@localhost","ö","Albert-Schweitzer-Schule","SFL Ingelheim"]
[31150,"SFL Nieder-Olm","Oppenheimer Str. 69",55268,"Nieder-Olm","(06136)2395","info@selztalschule-no.de","ö","Selztalschule","SFL Nieder-Olm"]
[31164,"SFLGS Oppenheim","Am Stadtbad 24",55276,"Oppenheim","(06133)92430","info@landskronschule.de","ö","Landskronschule","SFLGS Oppenheim"]
[31194,"SFS Neuwied","Schillerstr. 43",56567,"Neuwied","02631/975700","brueder-grimm-neuwied@t-online.de","ö","Brüder-Grimm-Schule","SFS Neuwied"]
[31210,"SFE Traben-Trarbach","Maiweg 140",56841,"Traben-Trarbach","(06541)816730","info@e-schule-mlk.de","p","Martin-Luther-King-Schule","SFE Traben-Trarbach"]
[31224,"SFGM Wissen","Holschbacher Str. 87",57537,"Wissen","(02742)3642","schulleitung@fs-alserberg.de","ö","Förderschule am Alserberg","SFGM Wissen"]
[31270,"SFG Alzey","Kirchenplatz 6a",55232,"Alzey","(06731)990950","info@loewenschule-alzey.de","ö","Löwenschule Alzey","SFG Alzey"]
[31300,"SFLE Koblenz I","Kastorpfaffenstr. 9-11",56068,"Koblenz","(0261)34160","diesterweg-schule@gmx.de","ö","Diesterweg-Schule","SFLSFE Koblenz I"]
[31314,"SFM Nieder-Olm","Maria-Montessori-Str. 2",55268,"Nieder-Olm","(06136)75890","info@sfm-nieder-olm.de","ö","Liesel-Metten-Schule","SFM Nieder-Olm"]
[31327,"SFLS Bad Neuenahr-Ahrweiler","Schützenstraße 83",53474,"Bad Neuenahr-Ahrweiler","(02641)34778","info@donbosco-aw.de","ö","Don-Bosco-Schule","SFL/SFS Bad Neuenahr-Ahrweiler"]
[31344,"SFL Scheuerfeld","Maximilian-Kolbe-Str. 1",57584,"Scheuerfeld","(02741)22391","schulleitung@mkschule.de","ö","Maximilian-Kolbe-Schule","SFL Scheuerfeld"]
[31357,"SFL Wissen","Böhmerstraße 14",57537,"Wissen","(02742)910703","verwaltung@wbs-wissen.de","ö","Wilhelm-Busch-Schule","SFL Wissen"]
[31360,"SFL Idar-Oberstein","Auf der Bein 7",55743,"Idar-Oberstein","(06784)8915","foerderschule.idar-oberstein@t-online.de","ö","Nahetal-Schule","SFL Idar-Oberstein"]
[31374,"SFL Boppard","Buchenauerstraße 70",56154,"Boppard","(06742)801590","info@hps-boppard.de","ö","Helene-Pagés-Schule","SFL Boppard"]
[31390,"SFLS Bitburg","Nansenstraße 25",54634,"Bitburg","(06561)944780","schule@maximin-schule.de","ö","Maximin-Schule","SFLS Bitburg"]
[31404,"SFLS Wiltingen","Rosenbergerstraße 130a",54459,"Wiltingen","(06501)16432","buero@dobowi.de","ö","Don Bosco-Schule","SFLSFS Wiltingen"]
[31417,"SFL Kaiserslautern","Erfurter Straße 68-70",67663,"Kaiserslautern","(0631)3505823","fritz-walter-schule@live.de","ö","Fritz-Walter-Schule","SFL Kaiserslautern"]
[31420,"SFLS Pirmasens","Winzler Str. 36/40",66955,"Pirmasens","06331-24050","foerderschule.matzenberg@pirmasens.de","ö","Matzenbergschule","SFLSFS Pirmasens"]
[31434,"SFLS Zweibrücken","Canadastr. 25",66482,"Zweibrücken","(06332)970100","canadaschule@schule-zw.de","ö","Canadaschule","SFLS Zweibrücken"]
[31447,"SFLS Alzey","Dr.-Georg-Durst-Str. 30",55232,"Alzey","(06731)49842-0","info@volkerschule.de","ö","Volkerschule - Schule mit den","FBZ-Alzey-Worms"]
[31464,"SFL Grünstadt","Jahnstraße 2",67269,"Grünstadt","(06359)96840","info@kks-gruenstadt.de","ö","Käthe-Kollwitz-Schule","SFL Grünstadt"]
[31480,"SFL Enkenbach-Alsenborn","Neukircher Str. 4",67677,"Enkenbach-Alsenborn","(06303)8008580","info@hans-zulliger-schule.eu","ö","Hans-Zulliger-Schule","SFL Enkenbach-Alsenborn"]
[31510,"SFL Bad Bergzabern","Zeppelinstraße 55",76887,"Bad Bergzabern","(06343)8176","info@altenbergschule.de","ö","Altenbergschule","SFL Bad Bergzabern"]
[31540,"SFL Ludwigshafen Schiller","Rheingönheimer Str. 103",67065,"Ludwigshafen am Rhein","(0621)504423920","sfl@schillerschule.com","ö","Schillerschule","SFL Ludwigshafen"]
[31554,"SFL Ludwigshafen Schloss","Schnabelbrunnengasse 41",67071,"Ludwigshafen am Rhein","(0621)504401710","info@localhost","ö","Schloss-Schule","SFL Oggersheim"]
[31583,"SFL Ludwigshafen Blies","Krummlachstraße 10",67059,"Ludwigshafen am Rhein","(0621)504420720","sfl@bliesschulen.de","ö","Schule an der Blies","SFL Ludwigshafen"]
[31600,"SFS Rülzheim","Schulstraße 16",76761,"Rülzheim","(07272)6413","info@sfs-ruelzheim.de","ö","Förderschule","SFS Rülzheim"]
[31627,"SFG Bernkastel-Kues","Am Rosenberg 32",54470,"Bernkastel-Kues","(06531)9719210","info@rosenberg-schule.de","ö","Rosenberg-Schule","SFG Bernkastel-Kues"]
[31630,"SFG Trier","Engelstraße 20",54292,"Trier","(0651)28011","info@porta-nigra-schule.de","ö","Porta-Nigra-Schule (SFG)"]
[31644,"SFG Frankenthal","Neumayerring 1",67227,"Frankenthal","(06233)298484","sekretariat@tom-mutters-schule.de","ö","Tom-Mutters-Schule","SFG Frankenthal"]
[31673,"SFLS Osthofen","Heinrich-Heine-Str. 13",67574,"Osthofen","(06242)912860","info@wonnegauschule..de","ö","Wonnegauschule","SFLS Osthofen"]
[31687,"SFGM Bad Neuenahr-Ahrweiler","Schützenstraße 85",53474,"Bad Neuenahr-Ahrweiler","(02641)36611","rektor@levana-aw.de","ö","Levana-Schule","SFGM Bad Neuenahr-Ahrweiler"]
[31690,"SFG Bad Kreuznach","Ellerbachstraße 17",55545,"Bad Kreuznach","(0671)32211","sekretariat@don-bosco-schule.de","ö","Don-Bosco-Schule","SFG Bad Kreuznach"]
[31704,"SFGM Düngenheim","St.-Martin-Straße 33",56761,"Düngenheim","(02653)598190","foerderschule@stmartin-dku.de","p","St.-Martin-Heimschule","SFG/SFM Düngenheim"]
[31717,"SFS Mainz","John F. Kennedy-Str. 5-7",55122,"Mainz","(06131)324726","schule.astrid-lindgren@stadt.mainz.de","ö","Astrid-Lindgren-Schule","SFS Mainz"]
[31720,"SFL Lauterecken","Schulstr. 14",67742,"Lauterecken","(06382)993689","Korczak-Schule-Lauterecken@t-online.de","ö","Janusz-Korczak-Schule","SFL Lauterecken"]
[31747,"SFE Kirchheimbolanden","Eichenweg 4",67292,"Kirchheimbolanden","(06352)408112","hps-hnschule@evh-pfalz.de","p","Herman-Nohl-Schule (SFE)","im Heilpädagogium Schillerhain"]
[31777,"SFM Trier","Trevererstraße 42",54295,"Trier","(0651)991939-0","buero@treverer-schule.de","ö","Treverer-Schule","SFM Trier"]
[31780,"SFGM Singhofen","Erich Kästner-Str. 5",56379,"Singhofen","(02604)9437-0","Kaestner-Schule@eks-singhofen.de","ö","Erich Kästner-Schule","SFGSFM(G) Singhofen"]
[31793,"SFM Ludwigshafen","Karl-Lochner-Str. 8",67071,"Ludwigshafen am Rhein","(0621)67005171","info@mosaikschule-lu.de","ö","Förderschule","SFM Ludwigshafen"]
[31807,"SFG Landau","Münchener Straße 11",76829,"Landau in der Pfalz","(06341)50324","sfg-pms@landau.de","ö","Paul-Moor-Schule","SFG Landau"]
[31810,"SFS Frankenthal","Neumayerring 7",67227,"Frankenthal","(06233)21070","verwaltung@neumayerschule.de","ö","Neumayer-Schule","SFS Frankenthal"]
[31824,"SFL Siershahn","Schillerstr. 22",56427,"Siershahn","(02623)5524","info@berggartenschule.de","ö","Berggarten-Schule","SFL Siershahn"]
[31837,"SFGM Höhn","Zehntgrafstraße 14",56462,"Höhn",-26228921200,"waschule@heinrich-haus.de","p","Wilhelm-Albrecht-Schule Höhn","SFG/SFM Höhn"]
[31853,"SFS Singhofen","Erich-Kästner-Str. 7",56379,"Singhofen","(02604)9437-12","oranienschule@sfs-rlp.de","ö","Oranienschule","SFS Singhofen"]
[31867,"SFS Hachenburg","Lohmühle 2a",57627,"Hachenburg","(02662)939457","info@schule-am-rothenberg.de","ö","Schule am Rothenberg","SFS Hachenburg"]
[31870,"SFS Idar-Oberstein","Auf der Bein 7",55743,"Idar-Oberstein","(06784)2372","www.sprachheilschule.io@web.de","ö","Förderschule","SFS Idar-Oberstein"]
[31897,"FöZ Gerolstein","Waldstraße 17",54568,"Gerolstein","06591-4177","mail@hrf-gerolstein.de","ö","Hubertus-Rader-Förderzentrum"]
[31900,"SFE Mayen UNESCO","Polcher Straße",56727,"Mayen","02651)8008-80/81","sekretariat-schule@jhz-bernardshof.de","p","UNESCO-Projektschule am","Bernardshof - SFE Mayen"]
[31914,"SFE Welschbillig","Puricellistraße 1",54298,"Welschbillig","(06506)899116","nadja.moll@helenenberg.de","p","Valdocco-Schule","SFE Welschbillig"]
[31927,"SFLGS Prüm","Kolpingstraße 30",54595,"Prüm","(06551)9516-0","info@astrid-lindgren-schule-pruem.de","ö","Astrid-Lindgren-Schule","SFL/SFG/SFS Prüm"]
[31930,"SFLS Trier Medard","Medardstraße 2",54294,"Trier","(0651)993796810","sekretariat@medardschule.de","ö","Medard-Schule Trier","SFL/SFS Trier"]
[31943,"SFL Germersheim Kreis","Römerweg 2a",76726,"Germersheim","(07274)3095","info@sflkg.de","ö","Schule mit dem FSP Lernen","Kreis Germersheim"]
[40008,"RS+ Mainz Anne Frank","Petersplatz 2",55116,"Mainz","06131-9060420","schule.anne-frank-rsplus@stadt.mainz.de","ö","Anne-Frank-Realschule plus","Mainz"]
[40024,"RS Speyer Edith-Stein","Gerhart-Hauptmann-Straße 4a",67346,"Speyer","(06232)99082850","info@esr-speyer.de","p","Private Edith-Stein-Realschule"]
[40037,"RS Landstuhl St. Katharina","Luitpoldstr. 28",66849,"Landstuhl","(06371)499098","sekretariat@skr-landstuhl.de","p","St.-Katharina-Realschule"]
[40041,"RS+FOS Koblenz St. Franziskus","Thielenstr. 3",56073,"Koblenz","(0261)57925180","st-franziskus-schule@bistum-trier.de","p","Realschule plus und","Fachoberschule Koblenz St.Fran"]
[40054,"RS Landau Maria Ward","Cornichonstr. 1",76829,"Landau in der Pfalz","(06341)92300","schule@mws-landau.de","p","Private Maria-Ward Realschule"]
[40067,"RS Kaiserslautern St. Franziskus","St.-Franziskus-Straße 2",67655,"Kaiserslautern","(0631)3175190","Info@St-Franziskus.Region-Kl.de","p","St.-Franziskus-Realschule"]
[40072,"RS Bad Neuenahr-Ahrweiler Ursulinen","Blandine-Merten-Straße 30",53474,"Bad Neuenahr-Ahrweiler","(02641)383251","sekretariat@realschule-calvarienberg.de","p","Priv. Realschule der Ursulinen","Calvarienberg Ahrweiler"]
[40085,"RS Boppard","Am Marienberg-Park 3",56154,"Boppard","(06742)20710","realschule-marienberg@bistum-trier.de","p","Bischöfliche Realschule","Marienberg"]
[40098,"RS Trier Blandine-Merten","Bernhardstraße 26",54295,"Trier","0651937412-0","schulleitung@bmrtrier.de","p","Blandine-Merten-Realschule"]
[40101,"RS Mainz Willigis","Willigisplatz 2",55116,"Mainz","(06131)2867626","schulleitung-realschule@willigis-online.","p","Bischöfliche Willigis","Realschule"]
[40114,"RS+FOS Frankenthal Schiller","Mörscher Str. 11",67227,"Frankenthal","(06233)28194","info@schiller-rs.de","ö","Friedrich-Schiller-","Realschule plus"]
[40127,"RS+ Ludwigshafen Anne-Frank","Bruchwiesenstraße 310",67059,"Ludwigshafen am Rhein","(0621)504430110","sekretariat@afrspluslu.de","ö","Anne-Frank-Realschule plus"]
[40144,"RS+FOS Nierstein","Bildstockstraße 19",55283,"Nierstein","(06133)509099-0","sekretariat@rsplus-nierstein.de","ö","Carl-Zuckmayer-Realschule plus","und Fachoberschule Nierstein"]
[40157,"RS+FOS Konz","Hermann-Reinholz-Straße 2",54329,"Konz","(06501)947011","verwaltung@rsplus-konz.de","ö","Realschule Plus und","Fachoberschule Konz"]
[40175,"GRS+ Ludwigshafen","Leuschnerstraße 131",67063,"Ludwigshafen am Rhein","(0621)504-423720","info@aes-lu.de","ö","Albert-Einstein-Schule","Grund- und Realschule plus"]
[40188,"RS+ Wittlich Kurfürst Balduin","Kurfürstenstraße 12",54516,"Wittlich","(06571)95240","info@rswittlich.de","ö","Kurfürst-Balduin-","Realschule plus"]
[40204,"RS+ Bitburg Talweg","Talweg 7",54634,"Bitburg","(06561)95240","schulleitung@rsplus-bitburg.de","ö","Otto-Hahn-Realschule plus"]
[40217,"RS+ Koblenz Clemens-Brentano","Weißer Gasse 6",56068,"Koblenz","(0261)31336","Info@cbors.de","ö","Clemens-Brentano-/Overberg","Realschule plus"]
[40221,"RS+FOS Adenau","Alte Poststraße 77",53518,"Adenau","(02691)92260","Info@hocheifelschule.de","ö","Hocheifel Realschule plus und","Fachoberschule Adenau"]
[40247,"RS+FOS Altenkirchen","Glockenspitze 6",57610,"Altenkirchen","(02681)2082","sekretariat@rsplus-altenkirchen.de","ö","August-Sander-Schule","Realschule plus und FOS"]
[40252,"RS+ Wissen","Pirzenthaler Straße 46",57537,"Wissen",27423097,"verwaltung@mdrsp.de","ö","Marion-Dönhoff","Realschule plus"]
[40265,"RS+ Bad Kreuznach Crucenia","Ringstraße 112",55543,"Bad Kreuznach","(0671)483523-0","info@cruceniarsplus-kh.de","ö","Crucenia-Realschule plus","-kooperative Realschule-"]
[40278,"RS+ Bad Sobernheim","Münchwiesen 41",55566,"Bad Sobernheim","(06751)85604-0","info@rsbadsobernheim.de","ö","Disibod-Realschule plus","Bad Sobernheim"]
[40295,"RS+ Idar-Oberstein Ida Purper","Vollmersbachstraße 55",55743,"Idar-Oberstein","(06781)568580","info@ida-purper-schule.de","ö","Ida-Purper-Schule","Kooperative Realschule plus"]
[40307,"RS+ Cochem","Schloßstraße 34",56812,"Cochem","(02671)60397-0","schule@rsplus-cochem.de","ö","Realschule plus Cochem"]
[40324,"RS+ Andernach Geschwister Scholl","Salentinstr. 12",56626,"Andernach","(02632)96560","verwaltung@gsra-ver.de","ö","Geschwister-Scholl","Realschule plus"]
[40337,"RS+ Mayen","Joignystr. 5",56727,"Mayen","(02651)970820","info@realschule-mayen.de","ö","Albert-Schweitzer","Realschule plus"]
[40342,"RS+FOS Mendig","Fallerstr. 49",56743,"Mendig","(02652)939390","verwaltung@realschuleplus-mendig.de","ö","Realschule plus","mit Fachoberschule"]
[40355,"RS+ Dierdorf","Schulstr. 22",56269,"Dierdorf","02689/94480","info@nelson-mandela-schule.de","ö","Nelson Mandela","Realschule plus"]
[40372,"RS+ Neustadt/Wied","Im Engelsgarten 3",53577,"Neustadt","(02683)988720","realschule-neustadt@t-online.de","ö","Realschule plus","Neustadt/Wied"]
[40385,"RS+ Bad Marienberg","Erlenweg 3",56470,"Bad Marienberg","(02661)914410","info@rsplus-badmarienberg.de","ö","Realschule plus Bad Marienberg"]
[40398,"RS+FOS Hachenburg","Kantstr. 19",57627,"Hachenburg","02662-1790","realschule-hachenburg@t-online.de","ö","Realschule plus und Fachober-","schule - Hachenburger Löwe -"]
[40401,"RS+ Rennerod","Kohlaustraße 17",56477,"Rennerod",26646300,"sekretariat@realschule-rennerod.com","ö","Realschule plus","Hoher Westerwald"]
[40414,"RS+ Westerburg","Wörthstr. 18",56457,"Westerburg","(02663)98010","sekretariat@realschuleplus-westerburg.de","ö","Realschule plus"]
[40445,"RS+ Kirchberg","Schulstraße 11",55481,"Kirchberg","(06763)9311-73","mail@kgs-kirchberg.de","ö","Ausonius-Realschule plus","Kirchberg/Hunsrück"]
[40458,"RS+ Oberwesel","Kirchstr. 61 - 71",55430,"Oberwesel","06744/93300","sekretariat@mrso.de","ö","Heuss-Adenauer","Mittelrhein-Realschule plus"]
[40462,"RS+ Diez","Danziger Str. 32",65582,"Diez","(06432)927110","info@theodissa.de","ö","Theodissa Realschule plus Diez"]
[40475,"RS+FOS Katzenelnbogen","Im Gänsberg 7",56368,"Katzenelnbogen",648690030,"verwaltung@rs-einrich.de","ö","Realschule plus und","Fachoberschule im Einrich"]
[40488,"RS+ Lahnstein","Oberheckerweg 4",56112,"Lahnstein","02621/9427-30","info@RS-Lahnstein.de","ö","Realschule plus Lahnstein"]
[40517,"RS+FOS Höhr-Grenzhausen","Am Scheidberg 2",56203,"Höhr-Grenzhausen","02624-94750-0","sekretariat@ebr-hg.de","ö","Ernst-Barlach","Realschule plus"]
[40522,"RS+ Montabaur Anne Frank","Wölfchesbitzstr. 2",56410,"Montabaur","(02602)99934-0","info@afrs.de","ö","Anne-Frank-Realschule plus"]
[40535,"RS+ Bernkastel-Kues","Peter-Kremer-Weg 2",54470,"Bernkastel-Kues","(06531)50194-0","sekretariat@rsplus-bks.de","ö","Freiherr-vom-Stein-","Realschule plus"]
[40552,"RS+ Neumagen-Dhron","Balduinstraße 15",54347,"Neumagen-Dhron","(06507)92640","info@fsrneumagen.de","ö","Friedrich-Spee-Realschule plus"]
[40565,"RS+FOS Traben-Trarbach","Köveniger Straße 78",56841,"Traben-Trarbach","(06541)8185170","buero@rsplusfostt.de","ö","Realschule plus und FOS","Traben-Trarbach"]
[40578,"GRS+ Neuerburg","Nelsstraße 4",54673,"Neuerburg","(06564)96040","verwaltung@realschule-neuerburg.de","ö","Grund- und Realschule plus","Schulzentrum"]
[40595,"RS+ Prüm Kaiser-Lothar","Wandalbertstraße 16",54595,"Prüm","(06551)971110","sekretariat@klrplus.de","ö","Kaiser-Lothar-Realschule plus","Schulzentrum"]
[40607,"RS+FOS Daun","Schulstraße 3",54550,"Daun",6592983180,"info@rsplusdaun.de","ö","Drei-Maare-Realschule plus","Daun und FOS - Koop.Realschule"]
[40612,"RS+ Hillesheim","Im Walkgraben 1",54576,"Hillesheim","(06593)320","augustiner-realschule@t-online.de","ö","Augustiner-Realschule plus"]
[40638,"RS+ Saarburg","Bahnhofstr. 14b",54439,"Saarburg","(06581)914030","sekretariat@rs-plus-saarburg.de","ö","Realschule plus Saarburg"]
[40642,"RS+ Kaiserslautern Kurpfalz","Im Stadtwald 2",67663,"Kaiserslautern","(0631)365-2840","kurpfalz@krsplus-kl.de","ö","Kurpfalz-Realschule plus","Schulzentrum im Stadtwald 2"]
[40655,"RS+FOS Landau Konrad-Adenauer","Fortstr. 2",76829,"Landau in der Pfalz","(06341)134600","info@kars-landau.de","ö","Konrad-Adenauer","Realschule plus"]
[40668,"RS+ Neustadt/Weinstraße","Landwehrstraße 20",67433,"Neustadt","(06321)918610","gvn@schulen.neustadt.eu","ö","Georg-von-Neumayer-Realschule"]
[40671,"RS+FOS Pirmasens","Herzogstraße 41",66953,"Pirmasens","(06331)242110","llrs-alleestrasse@pirmasens.de","ö","Landgraf-Ludwig","Realschule plus und FOS"]
[40698,"RS+ Zweibrücken Mannlich","Zeilbäumerstraße 8a",66482,"Zweibrücken","(06332)97240","sl@mannlich-rs.de","ö","Mannlich-Realschule plus"]
[40715,"RS+FOS Wörrstadt Rheingrafen","Pestalozzistraße 16",55286,"Wörrstadt","(06732)96567-0","sekretariat@rheingrafenschule.de","ö","Rheingrafenschule Wörrstadt"]
[40728,"RS+FOS Haßloch","Raiffeisenstr. 27",67454,"Haßloch","(06324)9246-0","info@rsplus-hassloch.de","ö","Siebenpfeiffer-Realschule plus","und Fachoberschule Haßloch"]
[40745,"RS+ Rockenhausen","Mühlackerweg 24c",67806,"Rockenhausen","(06361)9213-30/-","rsrok@t-online.de","ö","Realschule plus Rockenhausen"]
[40758,"RS+ Germersheim Weizsäcker","August-Keiler-Straße 35b",76726,"Germersheim","(07274)7072-0","info@realschule-germersheim.de","ö","Richard-von-Weizsäcker-","Realschule plus"]
[40761,"RS+ Kandel","Jahnstr. 18",76870,"Kandel","(07275)91440","sekretariat@rsplus-kandel.de","ö","Realschule plus","Kandel"]
[40775,"RS+ Kusel","Am Roßberg 1",66869,"Kusel","(06381)9969970","info@realschuleplus-kusel.de","ö","Realschule plus Kusel","Schulzentrum"]
[40788,"RS+ Annweiler","Herrenteichstr. 2",76855,"Annweiler am Trifels","(06346)96510","sekretariat@realschule-plus-annweiler.de","ö","Realschule plus","Annweiler"]
[40791,"RS+FOS Edenkoben","Luitpoldstr. 74",67480,"Edenkoben","06323-93813-0","sekretariat@realschule-edenkoben.de","ö","Paul-Gillet-Realschule plus","und Fachoberschule Edenkoben"]
[40805,"RS+ Herxheim","Südring 11",76863,"Herxheim bei Landau/ Pfalz","07276971-0","realschuleplus@pamina.bildung-rp.de","ö","Kooperative Gesamtschule","Realschule plus PAMINA-Schulz."]
[40818,"RS+ Limburgerhof","Neuhofener Str. 81d",67117,"Limburgerhof",6236479440,"verwaltung@rsplus-limburgerhof.de","ö","Rudolf-Wihr-Realschule plus","Limburgerhof"]
[40822,"RS+FOS Schifferstadt","Neustückweg 12",67105,"Schifferstadt",6235955440,"sekretariat@rsfos-schifferstadt.de","ö","Realschule plus im","Paul-von-Denis-Schulzentrum"]
[40835,"RS+FOS Bingen Rochus","Nuits-Saint-Georges-Str. 10",55411,"Bingen am Rhein","(06721)96354","info@rochus-realschule.de","ö","Rochus-Realschule plus","mit Fachoberschule"]
[40848,"RS+ Ingelheim","Ludwig-Langstädter-Str. 6",55218,"Ingelheim am Rhein","(06132)714410","sekretariat@kaiserpfalz-realschule.de","ö","Kaiserpfalz","Realschule plus"]
[40878,"RS+ Worms Karmeliter","Goethestr. 10a",67547,"Worms","(06241)44638","krsworms@gmx.de","ö","Karmeliter Realschule plus"]
[40881,"RS+ Worms Westend","Röderstr. 2",67549,"Worms","(06241)53355","sekretariat-wrs@schulen-worms.de","ö","Westend-Realschule plus"]
[40895,"RS+ Koblenz Auf der Karthause","Gothaer Straße 23-25",56075,"Koblenz","(0261)952610","rsk-dobbertin@online.de","ö","Realschule+ auf der Karthause","Schulzentrum"]
[40912,"RS+ Bad Neuenahr-Ahrweiler Boeselager","Schützenstr. 109",53474,"Bad Neuenahr-Ahrweiler","(02641)97930","post@boeselager-realschule.de","ö","Freiherr von Boeselager","Realschule plus Ahrweiler"]
[40925,"RS+ Neuwied Heinrich-Heine","Reckstr. 24",56564,"Neuwied","02631-3430970","sekretariat@hhr.bildung-rp.de","ö","Heinrich-Heine-Realschule plus"]
[40941,"RS+ Ludwigshafen Karolina-Burger","Karolina-Burger-Straße 38-40",67065,"Ludwigshafen am Rhein",6.2150442572000002E+21,"info@kbrsplus.de","ö","Karolina-Burger-RS+","im Schulzentrum Mundenheim"]
[40955,"RS+FOS Mainz Kanonikus-Kir","An Schneiders Mühle 2",55122,"Mainz",6131972280,"kkr@stadt.mainz.de","ö","Kanonikus-Kir-Realschule plus"]
[40968,"RS+ Trier Mandela","Speestraße 12b",54290,"Trier","(0651)9916960","info@nmr-trier.de","ö","Nelson Mandela RS+","Trier"]
[40971,"RS+FOS Schweich","Stefan-Andres-Straße 1",54338,"Schweich","(06502)92540","sekretariat@saz-schweich.de","ö","Stefan-Andres-Schule","Realschule+ mit Fachoberschule"]
[40985,"RS+FOS Dahn","Schloßstraße 19",66994,"Dahn","(06391)914100","realschule-plus-dahn@web.de","ö","Realschule plus mit","Fachoberschule Dahn"]
[40998,"RS+FOS Bad Bergzabern","Pestalozzistr. 18",76887,"Bad Bergzabern","(06343)98900","rsplus@schulebza.de","ö","Realschule plus","im Alfred-Grosser-Schulzentrum"]
[41003,"RS+ Bad Dürkheim","Kanalstraße 21",67098,"Bad Dürkheim","(06322)95190","sekretariat@carl-orff-realschule.de","ö","Realschule plus","Carl Orff"]
[41016,"RS+ Mainz-Lerchenberg","Hindemithstraße 1-5",55127,"Mainz","(06131)71138","schule.rsplus-lerchenberg@stadt.mainz.de","ö","Realschule plus","Lerchenberg"]
[41029,"RS+ Kirn Halmen","Halmer Weg 27",55606,"Kirn","(06752)137530","Verwaltung@Realschule-Kirn.de","ö","RS+ Auf Halmen Kirn Europa-","schule -Koop. Realschule-"]
[41032,"RS+ Trier Moseltal","Mäusheckerweg 1",54293,"Trier","(0651)9679860","mail@moseltalschule.de","ö","Moseltal Realschule plus Trier"]
[41046,"RS+ Bitburg St. Matthias","Prümer Straße 18",54634,"Bitburg","065619490-50","St-Matthias-Schule@bistum-trier.de","p","Priv. Realschule plus","St. Matthias"]
[41059,"RS+ Hargesheim","Kirchstr. 54",55595,"Hargesheim","(0671)483260","alfred-delp-schule@bistum-trier.de","p","Alfred-Delp-Schule","Realschule plus"]
[41076,"RS+FOS Alzey","Dr.-Georg-Durst-Str. 19",55232,"Alzey","(06731)99954-0","info@rsplus-alzey.de","ö","Gustav-Heinemann- Realschule","plus und Fachoberschule Alzey"]
[41092,"RS+ Maxdorf","Schulstraße 1",67133,"Maxdorf","(06237)9243310","mail@jvl-maxdorf.de","ö","Justus-von-Liebig-Realschule","Realschule plus Maxdorf"]
[41106,"RS+ Vallendar Marienschule","Höhrer Str. 74-76",56179,"Vallendar","(0261)60356","sl-rs@schoenstaetter-marienschule.de","p","Priv. Schönstätter Marienschul","Integrative Realschule plus"]
[41119,"RS+ Bellheim","Schulstr. 4",76756,"Bellheim","(07272)930120","info@rs-bellheim.de","ö","Realschule plus Bellheim"]
[41136,"RS+ Mülheim-Kärlich","Reihe Bäume 21",56218,"Mülheim-Kärlich","(02630)9402-1050","rsplus@sz-mk.de","ö","Realschule plus","an der Römervilla"]
[41166,"RS+ Bad Kreuznach am Rotenfels","Götzenfelsstraße 14",55583,"Bad Kreuznach","(06708)660096","schulleitung@rbme.de","ö","Realschule plus am Rotenfels","Bad Kreuznach"]
[41179,"RS+ Gau-Odernheim","Rossmarkt 5",55239,"Gau-Odernheim","(06733)9473111","schule@rsplusgo.de","ö","Realschule plus","am Alten Schloss"]
[41196,"RS+ Andernach St. Thomas","Salentinstr. 1a",56626,"Andernach","02632/940720","info@rsplus-st-thomas.de","ö","St. Thomas Realschule plus"]
[41209,"RS+ Betzdorf","Auf dem Bühl 1",57518,"Betzdorf","02741-910810","info@bvs.bildung-rp.de","ö","Bertha-von-Suttner RS plus"]
[41239,"RS+ Koblenz Schweitzer","Lehrhohl 46",56077,"Koblenz","(0261)8896590","info@rsplus-koblenz.de","ö","Albert Schweitzer Schule","Realschule plus"]
[41243,"RS+FOS Linz","Im Rosengarten 2",53545,"Linz am Rhein","(02644)97081-0","schulverwaltung@rks-linz.de","ö","Robert-Koch-Schule","Realschule plus und FOS"]
[41256,"RS+ Montabaur Heinrich Roth","Humboldtstraße 15",56410,"Montabaur","(02602)674932-0","sekretariat@hrs-mt.de","ö","Heinrich-Roth-Schule","Realschule plus"]
[41272,"RS+ Neuwied Robert-Krups","Marienstr. 21",56567,"Neuwied","(02631)975720","sekretariat@realschule-plus-neuwied.de","ö","Robert-Krups-Schule","Realschule plus Neuwied"]
[41286,"GRS+ St. Goarshausen","Loreleyring 100",56346,"Sankt Goarshausen","(06771)9393-10","info@loreleyschule.de","ö","Loreleyschule","GRS+ St. Goarshausen"]
[41299,"RS+ Waldbreitbach","In der Au 38",56588,"Waldbreitbach","(02638)4157","realschuleplus@dhs-waldbreitbach.de","ö","Realschule plus","Waldbreitbach"]
[41316,"GRS+ Westerburg Montessori","Theo-Neeb-Straße 5",56457,"Westerburg","02663-9114680","sekretariat@montessori-westerwald.de","p","Freie Montessori-Schule","Westerwald"]
[41329,"RS+ Altenahr","Grünstraße 10",53501,"Grafschaft","(02643)7397","info@ahrtalschule-altenahr.de","ö","Ahrtalschule - Realschule plus","Altenahr"]
[41333,"RS+FOS Asbach","Flammersfelder Straße 5a",53567,"Asbach","(02683)4723","schulleitung@rsasbach.de","ö","Realschule plus mit","Fachoberschule Asbach"]
[41346,"RS+ Bad Ems","Schulstr. 25",56130,"Bad Ems","(02603)2312","verwaltung@rs-be.de","ö","Realschule plus Bad Ems Nassau"]
[41359,"RS+ Bendorf","Lohweg 22",56170,"Bendorf","(02622)94330","buero@rs-bendorf.de","ö","Karl-Fries-Realschule plus"]
[41362,"RS+ Boppard","Auf der Zeil 20",56154,"Boppard","(06742)4893","sekretariat@fritz-strassmann-schule.de","ö","Fritz-Straßmann-Schule","Realschule plus Boppard"]
[41376,"RS+ Daaden","Goethestraße 39",57567,"Daaden","(02743)6015","info@hgs.bildung-rp.de","ö","Realschule plus Daaden","Hermann-Gmeiner-Schule"]
[41389,"RS+ Gebhardshain","Steinebacher Str. 12",57580,"Gebhardshain","(02747)2404","schule@ww-schule.de","ö","Westerwaldschule","Realschule plus"]
[41392,"RS+ Hahnstätten","Jahnstraße 27",65623,"Hahnstätten","(06430)925629","info@riaplus.de","ö","Realschule plus im Aartal"]
[41419,"RS+FOS Kobern-Gondorf Untermosel","Obermarkstraße 56",56330,"Kobern-Gondorf","Telefon:(02607)9","Mail:info@rsplus-untermosel.de","ö","Realschule+ und Fachoberschule","Untermosel Kobern-Gondorf"]
[41423,"RS+ Langenlonsheim","Heddesheimer Straße 24",55450,"Langenlonsheim","(06704)933910","sekretariat@sonnenbergschule-lalo.de","ö","Sonnenberg-Realschule plus","Langenlonsheim"]
[41436,"RS+ Meisenheim","Carl-Hellermann-Straße 48",55590,"Meisenheim","(06753)123769-0","rs.plus.meisenheim@gmx.de","ö","Realschule plus Meisenheim"]
[41449,"RS+ Nachtsheim","Greimerstälchen 3",56729,"Nachtsheim","(02656)95289-0","info@realschule-plus-nachtsheim.de","ö","Realschule plus Nachtsheim","St. Stephanus-Realschule plus"]
[41452,"RS+ Nentershausen","Rheinstr. 12-14",56412,"Nentershausen","(06485)911093","info@die-freiherr.de","ö","Freiherr-vom-Stein-Realschule","Nentershausen"]
[41466,"RS+ Neuwied-Niederbieber","In der Lach 4",56567,"Neuwied","(02631)9446190-0","info@cssneuwied.de","ö","Realschule plus Niederbieber"]
[41479,"RS+ Niederzissen","Arweg 19",56651,"Niederzissen","(02636)6693","info@brohltalschule.de","ö","Brohltalschule","Realschule plus"]
[41496,"RS+ Puderbach","Schulstr. 23",56305,"Puderbach","(02684)3035","sekretariat@rsplus-puderbach.de","ö","Realschule plus Puderbach","Friedrich-von-Bodelschwingh"]
[41509,"RS+ Ransbach-Baumbach","Osterfeldstr. 25",56235,"Ransbach-Baumbach","(02623)3084","sekretariat@eks-raba.de","ö","Erich Kästner Realschule plus","Baumbach"]
[41513,"RS+ Rheinböllen","Schulstraße 3",55494,"Rheinböllen","(06764)961160","info@puricelli-schule.de","ö","Puricelli-Realschule plus"]
[41526,"RS+ Rheinbrohl","Ruth-Dany-Weg 2",56598,"Rheinbrohl","(02635)9501-0","info@roemerwallschule.de","ö","Realschule plus Rheinbrohl"]
[41539,"RS+ Salz","Schulstr. 10",56414,"Salz","(06435)96450","post@schule-salz.de","ö","Realschule plus Salz"]
[41556,"RS+ Simmern","Kümbdcher Hohl 17",55469,"Simmern","(06761)93220","buero@rsplus-simmern.de","ö","Friedrich-Karl-Ströher","Realschule plus Simmern"]
[41569,"RS+ Sinzig","Werner-Lücke-Straße 1",53489,"Sinzig","(02642)994520","info@barbarossaschule-sinzig.de","ö","Barbarossaschule","Realschule plus Sinzig"]
[41572,"RS+FOS Sohren-Büchenbeuren","Michael-Felke-Straße 19",55487,"Sohren","(06543)9866-0","schulleitung@inrealplus.de","ö","Realschule plus & FOS","Sohren-Büchenbeuren"]
[41586,"RS+ Unkel","Linzer Straße 17b",53572,"Unkel","(02224)981580","sekretariat@Stefan-Andres-Schule.de","ö","Stefan-Andres-Schule","Realschule plus"]
[41599,"RS+ Vallendar Konrad-Adenauer","Sebastian-Kneipp-Straße 1a",56179,"Vallendar","(0261)69662","info@irsp-vallendar.de","ö","Realschule plus Vallendar","Konrad-Adenauer-Schule"]
[41603,"RS+ Wirges","Theodor-Heuss-Ring 4",56422,"Wirges","(02602)937310","post@rspluswirges.de","ö","Theodor-Heuss-Realschule plus"]
[41616,"RS+ Wittlich Clara-Viebig","Beethovenstraße 13",54516,"Wittlich","06571-950270","mail@cvrs-wil.de","ö","Clara-Viebig-Realschule plus"]
[41632,"GRS+ Gerolstein","Lissinger Straße 26a",54568,"Gerolstein","(06591)4219","info@grsplus-gerolstein.de","ö","Grund- und Realschule plus"]
[41646,"GRS+ Gillenfeld","Schulstraße 11",54558,"Gillenfeld","(06573)296","rgs.gillenfeld@vgdaun.de","ö","Schule am Pulvermaar","Grund- und Realschule plus"]
[41662,"GRS+ Irrel","Auf Omesen 13",54666,"Irrel","(06525)9348080","verwaltung@schule-irrel.de","ö","Franziskusschule","GRS+ Irrel"]
[41676,"GRS+ Jünkerath","Schulstraße 20-22",54584,"Jünkerath","(06597)92033-0","carina.moeller@graf-salentin-schule.de","ö","Graf-Salentin-Schule","Grund- und Realschule plus"]
[41689,"GRS+ Kelberg","Schulstraße 5-7",53539,"Kelberg","(02692)263","sekretariat@schulekelberg.de","ö","Grund- und Realschule plus","St. Martin Kelberg"]
[41692,"RS+ Kell","Schulstr. 12",54427,"Kell am See",6589330,"sekretariat@schule-kell.de","ö","Realschule plus","Kell am See"]
[41706,"GRS+ Treis-Karden","Im Schafsberg 22",56253,"Treis-Karden","(02672)95055-0","Info@grs-treis-karden.de","ö","Konrad Adenauer-Schule","GRS+ Treis-Karden"]
[41722,"GRS+ Waldrach","Schulstraße 8",54320,"Waldrach","(06500)426","sekretariat@ruwertalschule.de","ö","Ruwertalschule","Grund- und Realschule plus"]
[41736,"RS+ Altenglan","Schulstraße 14",66885,"Altenglan","(06381)2864","schule@rsplus-altenglan.bildung-rp.de","ö","Gustav-Schäffner-Schule","Realschule plus"]
[41749,"RS+FOS Birkenfeld/Niederbromb.","Brechkaul 17",55765,"Birkenfeld","(06782)98210","info@rs-birkenfeld.de","ö","Realschule plus","mit Fachoberschule"]
[41752,"RS+ Bleialf","Im Brühl 3",54608,"Bleialf","065559209-0","info@rsp-bleialf.de","ö","Realschule plus Bleialf"]
[41779,"RS+ Idar-Oberstein Rostocker Str.","Rostocker Straße 2",55743,"Idar-Oberstein","(06781)64710","rsplus-io@idar-oberstein.de","ö","Realschule plus"]
[41782,"RS+FOS Kaisersesch","Im Haag 5",56759,"Kaisersesch","(02653)9899-0","info@rsplusfos.de","ö","Kurfürst-Balduin-Schule","Realschule plus mit FOS"]
[41796,"RS+ Manderscheid","Cusanusstraße 7",54531,"Manderscheid","(06572)921611","info@rsplus-manderscheid.de","ö","Realschule plus Manderscheid"]
[41812,"RS+ Thalfang","Hauptstraße 43",54424,"Thalfang","(06504)741","erbeskopf-rsplusthalfang@freenet.de","ö","Erbeskopf-Realschule plus"]
[41826,"RS+ Ulmen/Lutzerath","Am Jungferweiher 2",56766,"Ulmen","02676-9521030","info@rsplus-vulkaneifel.de","ö","Realschule plus Vulkaneifel"]
[41839,"RS+FOS Lauterecken/Wolfstein","Im Tauchental 18",67752,"Wolfstein","06304/416829-0","sekretariat@rs-plus.de","ö","Realschule plus","Lauterecken/Wolfstein"]
[41869,"RS+ Pirmasens","Kirchbergstr. 41",66955,"Pirmasens","(06331)265111","info@rsplus-ps.de","ö","Käthe Dassler Realschule plus","Pirmasens"]
[41872,"RS+ Ramstein-Miesenbach","Schernauer Str. 31",66877,"Ramstein-Miesenbach",637196300,"info@rsplus-ramstein.de","ö","Realschule plus","Am Reichswald"]
[41899,"GRS+ Vinningen","Rehbergstr. 17",66957,"Vinningen","(06335)7612","info@schule-vinningen.de","ö","Konrad-Adenauer-Schule","GRS+ Vinningen"]
[41916,"RS+ Weisenheim am Berg","Neumayerstraße 27",67273,"Weisenheim am Berg","(06353)3952","Info@rsplus-weisenheim.de","ö","von Carlowitz Realschule plus"]
[41929,"GRS+ Westhofen","Osthofener Str. 40",67593,"Westhofen","(06244)9065-0","willkommen@ohs-westhofen.de","ö","Otto-Hahn-Schule","GRS+ Westhofen"]
[41932,"RS+ Bobenheim-Roxheim","Grünstadter Str. 6",67240,"Bobenheim-Roxheim",6239926721,"sekretariat@realschuleplus-bobrox.de","ö","Realschule plus Bobenheim-","Roxheim"]
[41946,"RS+ Böhl-Iggelheim","Am Schwarzweiher 1",67459,"Böhl-Iggelheim","(06324)9899530","willkommen@peter-gaertner-realschuleplus","ö","Peter-Gärtner","Realschule plus"]
[41959,"RS+ Bruchmühlbach-Miesau","Raiffeisenstr. 4 a",66892,"Bruchmühlbach-Miesau","(06372)619470","Sekretariat@adam-mueller-schule.de","ö","Adam-Müller-Schule","Realschule plus"]
[41976,"RS+ Dudenhofen","Iggelheimer Str. 37",67373,"Dudenhofen","(06232)2979710","info@rsplus-dudenhofen.de","ö","Realschule plus","Dudenhofen"]
[41989,"RS+ Eich","Schulstr. 2",67575,"Eich",6246906780,"mail@realschulepluseich.de","ö","Realschule plus Eich"]
[41992,"RS+ Gau-Algesheim","Appenheimer Str. 4",55435,"Gau-Algesheim","(06725)91953-0","sekretariat@realschule-plus-gau-algeshei","ö","Christian-Erbach-Schule","Realschule plus"]
[42007,"RS+FOS Göllheim","Königkreuzstr. 63",67307,"Göllheim","(06351)13133","info@rsplusfos-goellheim.de","ö","Gutenbergschule","Realschule plus mit FOS"]
[42010,"RS+ Hauenstein","Speyerstraße 32",76846,"Hauenstein","(06392)923260","mail@wasgauschule.de","ö","Wasgauschule Hauenstein","Realschule plus"]
[42024,"RS+ Kirchheimbolanden","Dr. Heinrich-v.-Brunck-Str. 47",67292,"Kirchheimbolanden","(06352)753240","sekretariat@gvnschule.de","ö","Georg-von-Neumayer-Schule","Realschule plus"]
[42037,"RS+ Lambrecht","Wiesenstr. 17",67466,"Lambrecht","(06325)7111","rsplus-lambrecht@t-online.de","ö","Realschule+ am Speyerbach"]
[42040,"RS+ Lingenfeld","Schillerstraße 10-12",67360,"Lingenfeld","(06344)969640","sekretariat@rsplus-lingenfeld.bildung-rp","ö","Realschule plus Lingenfeld"]
[42054,"RS+ Maikammer-Hambach","An der Steinmühle 14",67487,"Maikammer","06321/963965-0","sekretariat@rsp-maikammer-hambach.de","ö","Gebrüder-Ullrich-Realschule","plus Maikammer-Hambach"]
[42097,"RS+ Queidersbach","Jahnstraße 23a",66851,"Queidersbach","(06371)3762","RSplus.Queidersbach@t-online.de","ö","Realschule plus Queidersbach"]
[42100,"RS+ Rodalben","Gabelsberger Str. 4",66976,"Rodalben",null,null,"ö","Realschule plus","Gräfensteiner Land"]
[42127,"RS+ Weilerbach","In der Naßerde 30",67685,"Weilerbach","(06374)91490","rsplus-weilerbach@t-online.de","ö","Westpfalzschule","Realschule plus Weilerbach"]
[42130,"RS+ Winnweiler","Schulstr. 20a",67722,"Winnweiler","(06302)60991-0","schulleitung@asrplus.de","ö","Albert-Schweitzer-Schule","Realschule plus"]
[42144,"RS+ Wöllstein","Schulrat-Spang-Str. 7-9",55597,"Wöllstein","(06703)93040","info@realschuleplus-woellstein.de","ö","Realschule plus Wöllstein"]
[42204,"RS+ Flomborn/Flörsheim-Dalsheim","Albert-Schweitzer-Str. 1",67592,"Flörsheim-Dalsheim","06243-909680","info@rsplus-ffd.de","ö","Realschule plus","Flomborn/Flörsheim-Dalsheim"]
[42217,"RS+ Bingen Scharlachberg","Pestalozzistr. 1",55411,"Bingen am Rhein","06721-49781-0","info@rspbingen.de","ö","Realschule plus","Am Scharlachberg"]
[42220,"GRS+ Budenheim/Mainz-Mombach","Mühlstraße 28",55257,"Budenheim","06139-293700","sekretariat@lennebergschule.de","ö","Lenneberg Grund- und Real-","schule plus Mainz/Budenheim"]
[42234,"RS+ Koblenz Goethe","Brenderweg 123",56070,"Koblenz","(0261)869615","info@goethe-realschule.plus","ö","Realschule plus","Goethe-Schule"]
[42247,"RS+ Bad Neuenahr-Ahrweiler Kästner","St.-Pius-Straße 29",53474,"Bad Neuenahr-Ahrweiler","(02641)3373","info@eks-realschule.de","ö","Erich Kästner-Realschule plus","Bad Neuenahr-Ahrweiler"]
[42266,"RS+ Ludwigshafen Diesterweg","Adolf-Diesterweg-Str. 65",67071,"Ludwigshafen am Rhein","(0621)504424710","info@adrlu.de","ö","RS+ Adolf-Diesterweg","Kooperative Realschule plus"]
[42277,"RS+ Ludwigshafen Reuter","Schlesier Str. 56",67065,"Ludwigshafen am Rhein","(0621)504421320","info@erslu.de","ö","Ernst-Reuter-Schule","Realschule plus"]
[42324,"RS+ Speyer Burgfeld","Josef-Schmitt-Str. 30",67346,"Speyer",null,null,"ö","Burgfeld-Schule","Realschule plus"]
[42337,"RS+ Speyer Siedlung","Birkenweg 10",67346,"Speyer","(06232)14-1450","rsplus@siedlungsschule.de","ö","Realschule Plus","Siedlungsschule"]
[42340,"RS+ Flonheim","Bahnhofstr. 5",55237,"Flonheim","06734-91304-100","info@realschule-plus-flonheim.de","ö","Realschule plus","Flonheim"]
[42354,"RS+ Wörrstadt Erich-Kästner","Humboldtstraße 1",55286,"Wörrstadt","06732-2919","info@ekrs.net","ö","Erich-Kästner-Realschule plus","Wörrstadt"]
[42367,"RS+ Frankenthal Ebert","Jakobsplatz 3",67227,"Frankenthal","06233-4531","schulleitung@realschuleplus-frankenthal.","ö","Friedrich-Ebert-","Realschule plus"]
[42370,"RS+ Kaiserslautern Lina-Pfaff","Friedrichstr. 75",67655,"Kaiserslautern",63168898,"friedrichstrasse@lina-pfaff.de","ö","Lina-Pfaff","Realschule plus"]
[42397,"GRS+ Mainz Martinus","Weissliliengasse 11",55116,"Mainz","06131-229153","sekretariat@martinus-schule-weisslilieng","p","Martinusschule Weißliliengasse","Private Grund- und Realschule"]
[42400,"RS+ Kirn Kyrau","Kallenfelser Str. 71",55606,"Kirn","(06752)950640","sekretariat@rsplus-kirn.de","ö","Realschule plus Kirn Auf Kyrau"]
[42414,"RS+ Germersheim Scholl","Römerweg 2",76726,"Germersheim","(07274)919930","GSS-Germersheim@t-online.de","ö","Geschwister-Scholl-Schule","Realschule plus"]
[42427,"RS+ Worms Nibelungen","Karl-Hofmann-Anlage 2",67547,"Worms","(06241)911891-0","verwaltung@nibelungen-realschule-worms.d","ö","Nibelungen-Realschule plus"]
[42430,"RS+ Worms Pfrimmtal","Nievergoltstr. 63",67549,"Worms","(06241)75602","verwaltung@pfrimmtalschule.de","ö","Pfrimmtal","Realschule plus"]
[42444,"GRS+ Ingelheim Montessori","Carolinenstraße 2",55218,"Ingelheim am Rhein","06132-42299-0","info@bms-ingelheim.de","p","Bilinguale Montessori-Schule","Grund- und Realschule plus"]
[42457,"RS+ Trier Kurfürst-Balduin","Trierweiler Weg 12",54294,"Trier","(0651)99216830","info@kubawest.de","ö","Kurfürst-Balduin","Realschule plus"]
[42473,"RS+ Ludwigshafen Ebertpark","Virchowstr. 1",67063,"Ludwigshafen am Rhein","(0621)504425410","sekretariat@rsplus-am-ebertpark.de","ö","Realschule plus am Ebertpark"]
[42487,"RS+ Zweibrücken Herzog Wolfgang","Mozartstraße 1",66482,"Zweibrücken","(06332)92900","hwrsplus@schule-zw.de","ö","Herzog-Wolfgang","Realschule plus"]
[42490,"RS+ Trier Maximin","Maximinstraße 18b",54292,"Trier","(0651)147550","sekretariat-st-maximin-schule@bistum-tri","p","St.-Maximin-Schule","staatl. anerkannte Realschule+"]
[42504,"RS+ Speyer Nikolaus-von-Weis","Holzstr. 8",67346,"Speyer","(06232)6052645","sekretariat@nws-speyer.de","p","Nikolaus-von-Weis-","Realschule plus"]
[42517,"RS+ Neuwied FCSN","Dierdorfer Straße 413",56566,"Neuwied","02631-8253300","info@fcsn-rsplus.de","p","Freie Christliche Schule","Realschule plus"]
[42520,"GRS+ Kaiserslautern Paul-Gerhardt","Finkenstraße 14",67661,"Kaiserslautern","(06301)7997759","info@pgs-kl.de","p","Grund- und Realschule plus","Paul-Gerhardt-Schule"]
[42534,"RS+ Wallhausen/Waldböckelh.","Cremerstraße 4",55595,"Wallhausen",6706439,"rsplus@gs-schule.net","ö","Realschule plus","Wallhausen/Waldböckelheim"]
[42547,"GRS+ Trier Montessori","An der Jugendherberge 3",54292,"Trier",null,null,"p","Freie Montessori-Grundschule"]
[50001,"GY Hargesheim","Kirchstr. 54",55595,"Hargesheim","(0671)483260","alfred-delp-schule@bistum-trier.de","p","Alfred-Delp-Schule","Gymnasium"]
[50014,"GY Trier Angela-Merici","Neustr. 35",54290,"Trier","(0651)145980","amg@bistum-trier.de","p","Bischöfliches","Angela-Merici-Gymnasium"]
[50027,"GY Koblenz Cusanus","Hohenzollernstr. 13-17",56068,"Koblenz","(0261)915920","sekretariat-cusanus-gymnasium@bistum-tri","p","Bischöfliches Cusanus-","Gymnasium"]
[50030,"GY Mainz Willigis","Willigisplatz 2",55116,"Mainz","(06131)286760","schulleitung-gymnasium@willigis-online.d","p","Bischöfl. Willigis-Gymnasium"]
[50044,"GY Wittlich Cusanus","Kurfürstenstr. 14",54516,"Wittlich","(06571)956140","sl@cg-wittlich.eu","ö","Cusanus-Gymnasium"]
[50057,"GY Speyer Edith-Stein","Langensteinweg 5",67346,"Speyer","(06232)9908280","info@esg-speyer.de","p","Edith-Stein-Gymnasium"]
[50060,"GY Annweiler","Bannenbergstraße 17",76855,"Annweiler am Trifels","(06346)967-0","sekretariat@trifelsgymnasium.de","p","Evangelisches Trifels-","Gymnasium Annweiler"]
[50074,"GY Bolanden","Am Hofwiesbach 1",67295,"Bolanden","(06352)400550","sekretariat@weierhof.de","p","Priv. Gymnasium","Weierhof am Donnersberg"]
[50087,"GY Pirmasens Leibniz","Luisenstr. 2",66953,"Pirmasens","(06331)14590","info@leibniz-pirmasens.de","ö","Leibniz-Gymnasium"]
[50090,"GY Mainz Maria Ward","Ballplatz 3",55116,"Mainz","(06131)260122","mws@mws-mainz.de","p","Private Maria Ward-Schule"]
[50104,"GY Dierdorf","Gymnasialstraße 15",56269,"Dierdorf","(02689)297-0","mbgdierdorf@ekir.de","p","Priv. Martin-Butzer-Gymnasium","der Ev. Kirche im Rheinland"]
[50117,"GY Speyer Nikolaus-von-Weis","Vincentiusstraße 1",67346,"Speyer","(06232)315290","sekretariat@nwg-speyer.de","p","Priv. Nikolaus-von-Weis-","Gymnasium"]
[50120,"GY Marienstatt","Kloster Marienstatt 1",57629,"Streithausen","02662-96986-0","sekretariat@gymnasium-marienstatt.de","p","Priv. Gymnasium Marienstatt"]
[50134,"GY Bingen Hildegardis","Holzhauserstraße 16",55411,"Bingen am Rhein","(06721)91700","gym.sekretariat@hildegardisschule.org","p","Private Hildegardisschule"]
[50147,"GY Lahnstein Johannes","Johannesstr. 38",56112,"Lahnstein","(02621)96970","schulleitung@johannes-gymnasium.de","p","Johannes-Gymnasium"]
[50150,"GY Landau Maria-Ward","Cornichonstr. 1",76829,"Landau in der Pfalz","(06341)9230-0","schule@mws-landau.de","p","Priv. Maria-Ward-Gymnasium"]
[50164,"GY Remagen","Insel Nonnenwerth 1",53424,"Remagen","02228-6009420","sekretariat@nonnenwerth.de","p","Franziskus Gymnasium","Nonnenwerth Remagen"]
[50177,"GY Kaiserslautern St. Franziskus","St.-Franziskus-Straße 2",67655,"Kaiserslautern","(0631)3175190","Vollrath@st-franziskus.region-kl.de","p","St.-Franziskus-Gymnasium"]
[50180,"GY Meisenheim","Präses-Held-Str. 1",55590,"Meisenheim","06753/9393-0","schule-psg@ekir.de","p","Priv. Paul-Schneider-Gymnasium"]
[50194,"GY Vallendar","Höhrer Straße 74-76",56179,"Vallendar","(0261)60356","sl-gym@schoenstaetter-marienschule.de","p","Priv. Schönstätter","Marienschule - Gymnasium"]
[50207,"GY Biesdorf","Klosterstraße 2",54675,"Biesdorf","(06566)8060","schule@sjg-biesdorf.de","p","Privates St.-Josef-Gymnasium"]
[50210,"GY Bad Neuenahr-Ahrweiler Ursulinen","Blandine-Merten-Straße 30",53474,"Bad Neuenahr-Ahrweiler","(02641)383-201","sekretariat@gymnasium-calvarienberg.de","p","Priv. Gymnasium der Ursulinen","Calvarienberg Ahrweiler"]
[50224,"GY Mainz Rabanus-Maurus","117er Ehrenhof 2",55118,"Mainz","(06131)9503070","rama-mainz@stadt.mainz.de","ö","Rabanus-Maurus-Gymnasium"]
[50237,"GY Frankenthal Albert-Einstein","Parsevalplatz 2",67227,"Frankenthal","(06233)26733","sekretariat@a-e-g-frankenthal.de","ö","Albert-Einstein-Gymnasium"]
[50240,"GY Kaiserslautern Albert-Schweitzer","Martin-Luther-Str. 5",67657,"Kaiserslautern","(0631)366890","asg@asg-kl.de","ö","Albert-Schweitzer-Gymnasium"]
[50254,"GY Worms Rudi-Stephan","Von-Steuben-Straße 31",67549,"Worms","(06241)8534499","post@rsg.biz-worms.de","ö","Rudi-Stephan-Gymnasium"]
[50267,"GY Bad Neuenahr-Ahrweiler Are","Joseph-von-Fraunhofer-Straße 0",53501,"Grafschaft","(02641)75060","schulleitung@are-gymnasium.de","ö","Are-Gymnasium"]
[50284,"GY Montabaur Peter-Altmeier","Humboldtstraße 6",56410,"Montabaur","(02602)134980","info@musikgymnasium.de","ö","Peter-Altmeier-Gymnasium","Musikgymnasium"]
[50297,"GY Wittlich Peter-Wust","Koblenzer Str. 56",54516,"Wittlich","(06571)956437-0","info@PWG-WIL.de","ö","Peter-Wust-Gymnasium"]
[50300,"GY Neuerburg","Pestalozzistr. 21",54673,"Neuerburg","(06564)9673-0","schule@eifel-gymnasium.de","ö","Eifel-Gymnasium"]
[50314,"GY Kaiserslautern Heinrich-Heine","Im Dunkeltälchen 65",67663,"Kaiserslautern",631201040,"info@hhg-kl.de","ö","Heinrich-Heine-Gymnasium"]
[50330,"GY Alzey Staatl. Aufbau","Ernst-Ludwig-Str. 47-51",55232,"Alzey","(06731)9601-0","info@aufbaugymnasium-alzey.de","ö","Staatliches Aufbaugymnasium"]
[50344,"GY Trier Auguste-Viktoria","Dominikanerstr. 2",54290,"Trier","(0651)1461910","info@avg-trier.de","ö","Auguste-Viktoria-Gymnasium"]
[50357,"GY Andernach B.v.Suttner","Salentinstraße 4",56626,"Andernach","(02632)92910","info@bvs-andernach.de","ö","Bertha-von-Suttner-Gymnasium"]
[50360,"GY Ludwigshafen Carl-Bosch","Jägerstr. 9",67059,"Ludwigshafen am Rhein","(0621)504430810","cbg@cbglu.de","ö","Carl-Bosch-Gymnasium"]
[50374,"GY Landau Eduard-Spranger","Schneiderstr. 71",76829,"Landau in der Pfalz","(06341)98700","verwaltung@esg-landau.de","ö","Eduard-Spranger-Gymnasium"]
[50387,"GY Koblenz Eichendorff","Friedrich-Ebert-Ring 26-30",56068,"Koblenz","(0261)915940","sekretariat@eichendorff-koblenz.de","ö","Eichendorff-Gymnasium"]
[50390,"GY Worms Eleonoren","Karlsplatz 3",67549,"Worms","(06241)51077","info@elo-worms.de","ö","Eleonoren-Gymnasium"]
[50404,"GY Adenau","Dr.-Klausener-Straße 43-45",53518,"Adenau","(02691)92120","info@ekgadenau.de","ö","Erich-Klausener-Gymnasium"]
[50417,"GY Mainz Frauenlob","Adam-Karrillon-Str. 35",55118,"Mainz","(06131)612558","info@frauenlob-gymnasium.de","ö","Frauenlob-Gymnasium"]
[50420,"GY Betzdorf","Freiherr-vom-Stein-Straße 25",57518,"Betzdorf","(02741)935079-0","info@fvsgy.bildung-rp.de","ö","Freiherr-vom-Stein-Gymnasium"]
[50434,"GY Speyer Friedrich-Magnus-Schwerd","Vincentiusstr. 5",67346,"Speyer","(06232)141600","info@fmsg-speyer.de","ö","Friedrich-Magnus-Schwerd-","Gymnasium"]
[50447,"GY Trier Friedrich-Wilhelm","Olewiger Str. 2",54295,"Trier","(0651)966383-0","verwaltung@fwg-trier.com","ö","Friedrich-Wilhelm-Gymnasium"]
[50450,"GY Worms Gauß","Von-Steuben-Straße 31",67549,"Worms","(06241)8534400","gauss@gauss-worms.de","ö","Gauß-Gymnasium"]
[50464,"GY Ludwigshafen Geschwister-Scholl","Platz der Weißen Rose 1",67061,"Ludwigshafen am Rhein","(0621)504431110","gsg@schollonline.de","ö","Geschwister-Scholl-Gymnasium","Ludwigshafen am Rhein"]
[50477,"GY Koblenz Görres","Gymnasialstr. 3",56068,"Koblenz","(0261)12749","schulleitung@gymgoerres.bildung.koblenz.","ö","Görres-Gymnasium"]
[50480,"GY Bad Ems","Schulstr. 36",56130,"Bad Ems","(02603)96230","info@gg-badems.org","ö","Goethe-Gymnasium"]
[50493,"GY Idar-Oberstein Göttenbach","Auf der Bein 3",55743,"Idar-Oberstein","06784-90479-0","information@gg-io.de","ö","Göttenbach-Gymnasium"]
[50507,"GY Mainz Gutenberg","An der Philippsschanze 5",55131,"Mainz","(06131)9061550","mail@gg.bildung-rp.de","ö","Gutenberg-Gymnasium"]
[50510,"GY Montabaur Mons-Tabor","Von-Bodelschwingh-Straße 35",56410,"Montabaur","(02602)15800","leitung@mtg-mt.de","ö","Mons-Tabor-Gymnasium"]
[50524,"GY Pirmasens Immanuel-Kant","Wörthstr. 30",66953,"Pirmasens","(06331)240412","kant.gym@pirmasens.de","ö","Immanuel-Kant-Gymnasium"]
[50537,"GY Pirmasens Hugo-Ball","Lemberger Str. 89",66955,"Pirmasens","(06331)87780","sekretariat@hbgps.de","ö","Hugo-Ball-Gymnasium"]
[50540,"GY Kusel","Walkmühlstraße 9",66869,"Kusel","(06381)92300","sekretariat@siebenpfeiffer-gymnasium.de","ö","Siebenpfeiffer-Gymnasium","Kusel"]
[50554,"GY Speyer am Kaiserdom","Große Pfaffengasse 6",67346,"Speyer","(06232)141670","sekretariat@gak-speyer.de","ö","Gymnasium am Kaiserdom"]
[50567,"GY Mainz Schloss","Leo-Trepp-Platz 1",55116,"Mainz","(06131)907240","sekretariat@verwaltung.schloss-online.de","ö","Gymnasium am","Kurfürstlichen Schloss"]
[50570,"GY Kaiserslautern am Rittersberg","Ludwigstr. 20",67657,"Kaiserslautern","(0631)362170","info@rittersberg.de","ö","Gymnasium am Rittersberg"]
[50583,"GY Bad Kreuznach am Römerkastell","Heidenmauer 14",55543,"Bad Kreuznach","(0671)66464","info@roekakh.de","ö","Gymnasium am Römerkastell"]
[50597,"GY Alzey am Römerkastell","Jean-Braun-Str. 19",55232,"Alzey",673199880,"kontakt-sh@roeka-az.de","ö","Gymnasium am Römerkastell"]
[50600,"GY Bad Kreuznach an der Stadtmauer","Hospitalgasse 6",55543,"Bad Kreuznach","(0671)7946150","schule@stamaonline.de","ö","Gymnasium an der Stadtmauer"]
[50614,"GY Kaiserslautern Burggymnasium","Burgstr. 18",67659,"Kaiserslautern","(0631)371630","info@burg-kl.de","ö","Burggymnasium"]
[50627,"GY Koblenz auf der Karthause","Zwickauer Str. 22",56075,"Koblenz","(0261)95316-0","sekretariat@gymnasium-karthause.de","ö","Gymnasium auf der Karthause"]
[50644,"GY Koblenz auf dem Asterstein","Lehrhohl 50",56077,"Koblenz","(0261)92153720","sekretariat@gym-asterstein.de","ö","Gymnasium auf dem Asterstein"]
[50657,"GY Trier Friedrich-Spee","Mäusheckerweg 1",54293,"Trier","(0651)9679810","info@fsg-trier.de","ö","Friedrich-Spee-Gymnasium"]
[50660,"GY Konz","Hermann-Reinholz-Straße 6",54329,"Konz","(06501)9470-30","info@gymnasium-konz.de","ö","Gymnasium Konz"]
[50673,"GY Speyer Hans-Purrmann","Otto-Mayer-Str. 2",67346,"Speyer","(06232)141640","sekretariat@hpg-speyer.de","ö","Hans-Purrmann-Gymnasium"]
[50687,"GY Zweibrücken Helmholtz","Bleicherstraße 3",66482,"Zweibrücken","(06332)92540","info@hhg-zw.de","ö","Helmholtz-Gymnasium"]
[50690,"GY Simmern","Am Flachsberg 6",55469,"Simmern","(06761)95250","Buero@hjg-sim.de","ö","Herzog-Johann-Gymnasium"]
[50717,"GY Koblenz Hilda","Kurfürstenstr. 40-42",56068,"Koblenz","(0261)29670260","schulleitung@hilda-gymnasium.org","ö","Hilda-Gymnasium"]
[50720,"GY Trier Humboldt","Augustinerstraße 1",54290,"Trier","(0651)9795-0","verwaltung@hgt-trier.de","ö","Humboldt-Gymnasium"]
[50734,"GY Kaiserslautern Hohenstaufen","Möllendorfstr. 29",67655,"Kaiserslautern","(0631)370233","hsg@rptu.de","ö","Hohenstaufen-Gymnasium"]
[50747,"GY Neustadt Käthe-Kollwitz","Villenstraße 1",67433,"Neustadt","(06321)39250","kkg@schulen-neustadt.eu","ö","Käthe-Kollwitz-Gymnasium"]
[50750,"GY Boppard","Mainzer Straße 24",56154,"Boppard","(06742)805000","buero@kant-gymnasium-boppard.de","ö","Kant-Gymnasium"]
[50763,"GY Frankenthal Karolinen","Röntgenplatz 5",67227,"Frankenthal","(06233)9268","schulleitung@karolinen-gymnasium.de","ö","Karolinen-Gymnasium"]
[50777,"GY Wissen","Pirzenthalerstraße 43",57537,"Wissen","(02742)71798","info@gymnasium-wissen.de","ö","Kopernikus-Gymnasium"]
[50780,"GY Münstermaifeld","Kurfürst-Balduin-Str. 12-16",56294,"Münstermaifeld","(02605)98010","sekretariat@kubagym.de","ö","Kurfürst-Balduin-Gymnasium"]
[50793,"GY Neustadt Kurfürst-Ruprecht","Landwehrstr. 22",67433,"Neustadt","(06321)499010","sekretariat@krg-nw.de","ö","Kurfürst-Ruprecht-Gymnasium"]
[50807,"GY Andernach Salentin","Salentinstraße 1",56626,"Andernach","(02632)96610","kontakt@ksgandernach.de","ö","Kurfürst-Salentin-Gymnasium"]
[50810,"GY Neustadt Leibniz","Karolinenstr. 103",67434,"Neustadt","(06321)484448","lg@schulen.neustadt.eu","ö","Leibniz-Gymnasium"]
[50824,"GY Grünstadt","Kreuzerweg 4",67269,"Grünstadt","(06359)93210","lein-gym@lg.bildung-rp.de","ö","Leininger-Gymnasium"]
[50837,"GY Bad Kreuznach Lina-Hilger","Gustav-Pfarrius-Str. 11-15",55543,"Bad Kreuznach","(0671)92894220","info@lihi-kh.de","ö","Lina-Hilger-Gymnasium"]
[50840,"GY Cochem","Schloßstraße 28",56812,"Cochem","(02671)91679-0","sekretariat@gymnasium-cochem.de","ö","Martin-von-Cochem-Gymnasium"]
[50853,"GY Linz","Martinusstraße 3",53545,"Linz am Rhein","(02644)95130","sekretariat@martinus-gymnasium.de","ö","Martinus-Gymnasium"]
[50867,"GY Trier Max-Planck","Sichelstraße 3",54290,"Trier","(0651)1461950","info@mpg-trier.de","ö","Max-Planck-Gymnasium"]
[50870,"GY Ludwigshafen Max-Planck","Leuschnerstraße 121",67063,"Ludwigshafen am Rhein","(0621)504431510","info@mpglu.de","ö","Max-Planck-Gymnasium"]
[50883,"GY Koblenz Max-von-Laue","Südallee 1-9",56068,"Koblenz","(0261)91483-0","schulleitung@mvlg.de","ö","Max-von-Laue-Gymnasium"]
[50897,"GY Lahnstein Marion-Dönhoff","Oberheckerweg 2-4",56112,"Lahnstein","02621-94270","sekretariat-mdg@mdg-lahnstein.de","ö","Marion-Dönhoff-Gymnasium","im Schulzentrum Lahnstein"]
[50900,"GY Traben-Trarbach","Bernkasteler Weg 72",56841,"Traben-Trarbach","(06541)83820","info@gymtt.de","ö","Gymnasium Traben-Trarbach"]
[50914,"GY Daun Geschwister-Scholl","Schulstraße 1",54550,"Daun","(06592)173010","Sekretariat@gsg-daun.de","ö","Geschwister-Scholl-Gymnasium"]
[50927,"GY St. Goarshausen","Gymnasialstr. 2-5",56346,"Sankt Goarshausen","(06771)93130","sekretariat@whg-web.de","ö","Wilhelm-Hofmann-Gymnasium"]
[50930,"GY Diez","Danziger Str. 30",65582,"Diez","(06432)927120","kontakt@shgym-diez.de","ö","Sophie-Hedwig-Gymnasium","im Schulzentrum Diez"]
[50943,"GY Mayen","Am Knüppchen 1",56727,"Mayen","(02651)96940","info@megina-gymnasium-mayen.de","ö","Megina-Gymnasium"]
[50957,"GY Hermeskeil","Borwiesenstr. 19-21",54411,"Hermeskeil","(06503)952000","sek@gymherm.de","ö","Gymnasium Hermeskeil"]
[50960,"GY Saarburg","Graf-Siegfried-Str. 72",54439,"Saarburg","06581-9173-0","sekretariat@gymsab.de","ö","Gymnasium Saarburg"]
[50973,"GY Landau Max-Slevogt","Hindenburgstr. 2",76829,"Landau in der Pfalz","(06341)92310","Sekretariat@msg.bildung-rp.de","ö","Max-Slevogt-Gymnasium"]
[50987,"GY Oppenheim","An der Festwiese 2",55276,"Oppenheim","(06133)94300","schule@gym-oppenheim.de","ö","Gymnasium zu St. Katharinen"]
[50990,"GY Kirn","Turnstr. 2",55606,"Kirn","(06752)8144","verwaltung@gymnasium-kirn.de","ö","Gymnasium Kirn"]
[51005,"GY Bad Sobernheim","Poststr. 36",55566,"Bad Sobernheim","(06751)930840","postmaster@emanuel-felke-gymnasium.de","ö","Emanuel-Felke-Gymnasium"]
[51018,"GY Birkenfeld","Brechkaul 10-12",55765,"Birkenfeld",678299940,"verwaltung@gymbir.de","ö","Gymnasium Birkenfeld"]
[51021,"GY Idar-Oberstein an der Heinzenwies","Heinzenwies 5",55743,"Idar-Oberstein","(06781)986430","verwaltung@heinzenwies.de","ö","Gymnasium an der Heinzenwies"]
[51034,"GY Bendorf","Mühlenstr. 35",56170,"Bendorf","(02622)90360","info@wrg-online.de","ö","Wilhelm-Remy-Gymnasium"]
[51048,"GY Westerburg","Wörthstraße 16",56457,"Westerburg","(02663)94380","sekretariat@kag-westerburg.de","ö","Konrad-Adenauer-Gymnasium"]
[51051,"GY Ludwigshafen Heinrich-Böll","Karolina-Burger-Straße 42",67065,"Ludwigshafen am Rhein","(0621)504425730","info@hbg-lu.de","ö","Heinrich-Böll-Gymnasium","im Schulzentrum Mundenheim"]
[51064,"GY Mainz-Gonsenheim","An Schneiders Mühle 1",55122,"Mainz","(06131)906560","osg-mainz@stadt.mainz.de","ö","Otto-Schott Gymnasium","Gonsenheim"]
[51078,"GY Zweibrücken Hofenfels","Zeilbäumer Straße 1",66482,"Zweibrücken","063324806-0","info@hofenfels.de","ö","Hofenfels-Gymnasium"]
[51081,"GY Alzey Elisabeth-Langgässer","Frankenstr. 17",55232,"Alzey","(06731)94775-0","sekretariat@elg-alzey.de","ö","Elisabeth-Langgässer-Gymnasium"]
[51094,"GY Bad Dürkheim","Kanalstr. 19",67098,"Bad Dürkheim","(06322)94800","whg-duew@gmx.de","ö","Werner-Heisenberg-Gymnasium"]
[51108,"GY Germersheim","August-Keiler-Straße 34",76726,"Germersheim","(07274)702470","info@goethe-gym-ger.de","ö","Johann-Wolfgang-Goethe-","Gymnasium"]
[51111,"GY Wörth","Forststr. 1",76744,"Wörth am Rhein","(07271)76040","verwaltung@egwoerth.de","ö","Europa-Gymnasium"]
[51124,"GY Landstuhl","Philipp-Fauth-Straße 3",66849,"Landstuhl","(06371)92220","info@sickingengymnasium.de","ö","Sickingen-Gymnasium"]
[51138,"GY Lauterecken","Amselstr. 22",67742,"Lauterecken","(06382)92300","sekretariat@veldenzgymnasium.de","ö","Veldenz Gymnasium"]
[51141,"GY Bad Bergzabern","Lessingstr. 24",76887,"Bad Bergzabern","(06343)93440","gymnasium@schulebza.de","ö","Gymnasium im Alfred-Grosser-","Schulzentrum"]
[51154,"GY Bernkastel-Kues","Peter-Kremer-Weg 4",54470,"Bernkastel-Kues","06531-501890","schule@nvk-gymnasium-bks.de","ö","Nikolaus-von-Kues-Gymnasium"]
[51168,"GY Kirchheimbolanden","Dr.-Heinrich-v-Brunck-Str. 47a",67292,"Kirchheimbolanden","(06352)70550","info@nordpfalzgymnasium.de","ö","Nordpfalzgymnasium"]
[51171,"GY Dahn","Schloßstraße 19",66994,"Dahn","(06391)914150","sekretariat@owg-dahn.de","ö","Otfried-von-Weißenburg-","Gymnasium"]
[51184,"GY Landau Otto-Hahn","Westring 11",76829,"Landau in der Pfalz","(06341)134800","gymnasium@ohg-landau.info","ö","Otto-Hahn-Gymnasium"]
[51198,"GY Prüm Regino","Im Eulenrech 7b",54595,"Prüm","(06551)9531-0","sekretariat@regino-gym.de","ö","Regino-Gymnasium"]
[51201,"GY Sinzig","Dreifaltigkeitsweg 35",53489,"Sinzig",2642983230,"office@rhein-gymnasium-sinzig.de","ö","Rhein-Gymnasium Sinzig"]
[51214,"GY Neuwied Rhein-Wied","Im Weidchen 2",56564,"Neuwied","(02631)39550","Schulleitung@rwg-neuwied.de","ö","Rhein-Wied-Gymnasium"]
[51228,"GY Ingelheim Sebastian-Münster","Friedrich-Ebert-Str. 13",55218,"Ingelheim am Rhein","(06132)71650","info@smg-ingelheim.de","ö","Sebastian-Münster-Gymnasium"]
[51231,"GY Gerolstein","Digoinstr. 1",54568,"Gerolstein","(06591)949870","info@sankt-matthias-gymnasium.de","ö","St.-Matthias-Gymnasium"]
[51244,"GY Bitburg St. Willibrord","Denkmalstraße 8",54634,"Bitburg","065616024-0","gymnasium@st-willi.de","ö","St.-Willibrord-Gymnasium"]
[51258,"GY Bingen Stefan-George","Morschfeldweg 5",55411,"Bingen am Rhein","(06721)49100","sekretariat@sgg-bingen.de","ö","Stefan-George-Gymnasium"]
[51261,"GY Ludwigshafen Theodor-Heuss","Freiastraße 10",67059,"Ludwigshafen am Rhein","(0621)504431710","sekretariat@thg-lu.de","ö","Theodor-Heuss-Gymnasium"]
[51274,"GY Neuwied Heisenberg","Engerser Landstr. 32",56564,"Neuwied","(02631)39640","info@whgneuwied.de","ö","Werner-Heisenberg-Gymnasium"]
[51288,"GY Altenkirchen","Glockenspitze 1",57610,"Altenkirchen","(02681)2081","sekretariat@westerwald-gymnasium.de","ö","Westerwald-Gymnasium"]
[51291,"GY Winnweiler","Gymnasiumstraße 15",67722,"Winnweiler","(06302)92250","sekretariat@weg-winnweiler.de","ö","Wilhelm-Erb-Gymnasium"]
[51304,"GY Bad Neuenahr-Ahrweiler Peter-Joerres","Uhlandstr. 30",53474,"Bad Neuenahr-Ahrweiler","(02641)97970","info@pjg-aw.de","ö","Peter-Joerres-Gymnasium"]
[51318,"GY Daun Thomas-Morus","Freiherr-vom-Stein-Str. 14",54550,"Daun",496592983500,"schule@tmg-daun.de","ö","Thomas-Morus-Gymnasium"]
[51321,"GY Mainz Theresianum","Oberer Laubenheimer Weg 58",55131,"Mainz","(06131)982440","schulleitung@theresianum-mainz.de","p","Priv. Theresianum-Gymnasium"]
[51334,"GY Prüm Vinzenz-von-Paul","Vinzenz-von-Paul-Str. 5",54595,"Prüm",655114739945,"Sekretariat@vvpg.de","p","Priv. Vinzenz-von-Paul-","Gymnasium"]
[51348,"GY Höhr-Grenzhausen","Am Scheidberg 4",56203,"Höhr-Grenzhausen","(02624)94080","info@gik-hg.de","ö","Gymnasium im Kannenbäckerland"]
[51351,"GY Neustadt/Wied","Friedenstraße 9",53577,"Neustadt","(02683)988710","sekretariat@wiedtal-gymnasium.de","ö","Wiedtal-Gymnasium"]
[51364,"GY Nieder-Olm","Karl-Sieben-Str. 39",55268,"Nieder-Olm","(06136)91560","info@gymno.de","ö","Gymnasium Nieder-Olm"]
[51378,"GY Schifferstadt","Am Schulzentrum 1",67105,"Schifferstadt","(06235)955410","sekretariat@verwaltung-gym-schiff.de","ö","Paul-von-Denis-Gymnasium","im Schulzentrum Schifferstadt"]
[51381,"GY Ludwigshafen Wilhelm-von-Humboldt","Mühlaustr. 13",67069,"Ludwigshafen am Rhein","0621-504-431910","sekre@whg-lu.de","ö","Wilhelm-von-Humboldt-Gymnasium"]
[51395,"GY Haßloch","Viroflayer Straße 20",67454,"Haßloch","(06324)92700","sekretariat@hagh.net","ö","Hannah-Arendt-Gymnasium"]
[51408,"GY Herxheim","Südring 11",76863,"Herxheim bei Landau/ Pfalz","(07276)9710","gymnasium@pamina.bildung-rp.de","ö","Kooperative Gesamtschule","Gymnasium PAMINA-Schulzentrum"]
[51411,"GY Ramstein-Miesenbach","Zum Kirchbühl 14",66877,"Ramstein-Miesenbach","(06371)96480","sekretariat@reichswald-gymnasium.de","ö","Reichswald-Gymnasium","Ramstein-Miesenbach"]
[51425,"GY Schweich Bonhoeffer","Dietrich-Bonhoeffer-Str. 1",54338,"Schweich","(06502)93980","briefkasten@dbg-schweich.de","p","Dietrich-Bonhoeffer-Gymnasium"]
[51438,"GY Bad Marienberg","Erlenweg 5",56470,"Bad Marienberg","02661-980870","sekretariat@ev-gymnasium.de","p","Evangelisches","Ganztagsgymnasium"]
[51441,"GY Edenkoben","Weinstr. 134",67480,"Edenkoben","06323-94880","Sekretariat@Gymnasium-Edenkoben.de","ö","Gymnasium Edenkoben"]
[51455,"GY Maxdorf","Schulstraße 4",67133,"Maxdorf","0623792433-50","sekretariat@lmg8.de","ö","Lise-Meitner-Gymnasium G8GTS"]
[51468,"GY Nackenheim","Pommardstr. 17",55299,"Nackenheim","06135-706920","kontakt@gymnasium-nackenheim.de","ö","Gymnasium Nackenheim"]
[51471,"GY Schweich Stefan Andres","Stefan-Andres-Straße 1",54338,"Schweich","(06502)9978620","verwaltung@sag-schweich.de","ö","Stefan-Andres-Gymnasium"]
[51485,"GY Mainz-Oberstadt","Hechtsheimer Str. 29",55131,"Mainz",6131629740,"schule.gymnasium-oberstadt@stadt.mainz.d","ö","Gymnasium","Mainz-Oberstadt"]
[51498,"GY Kirchberg","Schulstraße 11",55481,"Kirchberg","06763/9311-95","mail@kgs-kirchberg.de","ö","Ausonius-Gymnasium","Kirchberg/Hunsrück"]
[51501,"GY Dernbach","Burgweg 21-23",56428,"Dernbach","(02602)1067335","schulverwaltung@raiffeisen-campus.de","p","Privates Gymnasium","Raiffeisen-Campus"]
[51515,"GY Mülheim-Kärlich","Reihe Bäume 21",56218,"Mülheim-Kärlich","(02630)94020","gymnasium@sz-mk.de","ö","Mittelrhein-Gymnasium im","Schulzentrum Mülheim-Kärlich"]
[51528,"GY Bitburg St. Matthias","Prümer Straße 18",54634,"Bitburg","065619490-50","St-Matthias-Schule@bistum-trier.de","p","Priv. Gymnasium St. Matthias"]
[51531,"GY Altendiez","Helenenstr. 19",65624,"Altendiez",64329527880,"administration@campus-altendiez.de","p","Privates Gymnasium","Oranien-Campus Altendiez"]
[51545,"GY Nassau","Auf der Au 2",56377,"Nassau","02604/94367-0","schulverwaltung@leifheit-campus.de","p","Privates Gymnasium","Leifheit-Campus Nassau"]
[51558,"GY Speicher","Wiedenhofen 15",54662,"Speicher","(06562)96740","sekretariat@gymnasium-speicher.de","p","Genossenschaftliches","Gymnasium Speicher"]
[51561,"GY Mainz-Mombach","Brucknerstraße 1",55127,"Mainz",null,null,"ö","Gymnasium Mainz-Mombach"]
[51575,"GY Bingen Hildegardis","Holzhauserstraße 16",55411,"Bingen am Rhein",null,null,"ö","Hildegardisschule"]
[59000,"Koll/AGY Mainz","Rektor-Plum-Weg 10",55122,"Mainz","(06131)588920","info@ketteler-kolleg.de","ö","Ketteler-Kolleg und -Abend-","gymnasium mit Abitur-online"]
[59013,"Koll/AGY Koblenz","Kurfürstenstr. 41",56068,"Koblenz","(0261)32125","kontakt@koblenz-kolleg.de","ö","Staatl. Koblenz-Kolleg u. Abgy"]
[59026,"Koll/AGY Speyer","Butenschönstr. 2",67346,"Speyer","(06232)65300","info@pfalz-kolleg.de","ö","Staatliches Pfalz-Kolleg","und -Abendgymnasium Speyer"]
[59043,"Koll Neuerburg","Pestalozzistr. 21",54673,"Neuerburg","(06564)9673-0","info@eifel-kolleg.de","ö","Eifel-Kolleg"]
[60003,"BBS Frankenthal FOES","Holzhofstr. 21",67227,"Frankenthal","(06233)4909-0","info@pih.bv-pfalz.de","ö","Augustin-Violet-Schule","BBS Gehörlose und Schwerhörige"]
[60046,"BBS Bad Neuenahr-Ahrweiler","Kreuzstr. 120",53474,"Bad Neuenahr-Ahrweiler","(02641)9464-0","info@bbs-ahrweiler.de","ö","Berufsbildende Schule","des Landkreises Ahrweiler"]
[60059,"BBS Wissen","Hachenburger Str. 47",57537,"Wissen","(02742)93370","sekretariat@bbs-wissen.de","ö","Berufsbildende Schule Wissen"]
[60062,"BBS Kirn","Berliner Platz 1",55606,"Kirn","(06752)13133-0","info@bbs-kirn.de","ö","Berufsbildende Schule Kirn"]
[60076,"BBS Cochem","Ravenéstraße 19",56812,"Cochem","(02671)91697-0","info@bbs-cochem.de","ö","Berufsbildende Schule Cochem"]
[60089,"BBS Mayen","Gerberstr. 1",56727,"Mayen","(02651)98910","info@bbs-mayen.de","ö","Berufsbildende Schule Mayen"]
[60092,"BBS Linz","Am Gestade 9",53545,"Linz am Rhein","(02644)95280","buero@bbs-linz.de","ö","Alice-Salomon-Schule","BBS Linz"]
[60106,"BBS Westerburg","Hofwiesenstraße 1",56457,"Westerburg","(02663)99040","info@bbs-westerburg.de","ö","Berufsbildende Schule","Westerburg"]
[60119,"BBS Boppard","Antoniusstraße 21",56154,"Boppard","(06742)80610","info@bbs-boppard.de","ö","Berufsbildende Schule Boppard"]
[60122,"BBS Simmern","Liselottestraße 27",55469,"Simmern","(06761)2020","info@bbs-simmern.de","ö","Berufsbildende Schule Simmern"]
[60136,"BBS Diez","Königsberger Str. 5",65582,"Diez","(06432)92880","sekretariat@naos-diez.de","ö","Nicolaus-August-Otto-Schule","Berufsbildende Schule"]
[60149,"BBS Lahnstein","Schulstraße 2-4",56112,"Lahnstein","(02621)94230","buero@bbs-lahnstein.de","ö","Berufsbildende Schule","Lahnstein"]
[60152,"BBS Montabaur","Von-Bodelschwingh-Straße 33",56410,"Montabaur","(02602)15750","buero@bbs-montabaur.de","ö","Berufsbildende Schule","Montabaur"]
[60179,"BBS Bernkastel-Kues","Bornwiese 9",54470,"Bernkastel-Kues","(06531)972090","sekretariat@bbs-bks.de","ö","Berufsbildende Schule","Bernkastel-Kues"]
[60182,"BBS Wittlich","Rudolf-Diesel-Straße 1",54516,"Wittlich","(06571)9778-0","info@bbs-wittlich.de","ö","Berufsbildende Schule für","Technologie u. Umwelt Wittlich"]
[60196,"BBS Bitburg Simon","Rittersdorfer Straße 2",54634,"Bitburg","(06561)6005-0","sekretariat@tssbit.de","ö","Theobald-Simon-Schule","Berufsbildende Schule"]
[60209,"BBS Prüm","Kreuzerweg 16",54595,"Prüm","(06551)97105-0","verwaltung@bbspruem.de","ö","Berufsbildende Schule","Prüm"]
[60212,"BBS Gerolstein","Sarresdorfer Str. 44",54568,"Gerolstein","(06591)95660","Schulleitung@bbs-vulkaneifel.de","ö","Berufsbildende Schule","Vulkaneifel"]
[60226,"BBS Frankenthal Albert","Petersgartenweg 9",67227,"Frankenthal","(06233)26740","sekretariat@andreas-albert-schule.de","ö","Andreas-Albert-Schule","Berufsbildende Schule"]
[60239,"BBS Landau","August-Croissant-Str. 27",76829,"Landau in der Pfalz","(06341)134500","sekretariat@bbs-landau.de","ö","Berufsbildende Schule Landau"]
[60242,"BBS Neustadt","Robert-Stolz-Str. 30",67433,"Neustadt","063214900-0","sekretariat@bbs-nw.de","ö","Berufsbildende Schule","Neustadt/Weinstraße"]
[60256,"BBS Pirmasens","Adlerstraße 31",66955,"Pirmasens","(06331)24010","info@bbspirmasens.de","ö","Berufsbildende Schule","Pirmasens"]
[60272,"BBS Speyer","Josef-Schmitt-Straße 28",67346,"Speyer","(06232)141950","verwaltung@bbs-speyer.de","ö","Johann-Joachim-Becher-Schule"]
[60286,"BBS Zweibrücken","Johann-Schwebel-Str. 1",66482,"Zweibrücken","(06332)92460","info@bbs-zw.de","ö","BBS Zweibrücken","Ignaz-Roth-Schule"]
[60299,"BBS Alzey","Dr.-Georg-Durst-Str. 34",55232,"Alzey","(06731)96360","info@bbs-alzey.net","ö","Berufsbildende Schule Alzey"]
[60302,"BBS Rockenhausen","Alleestr. 8",67806,"Rockenhausen","(06361)92110","sekretariat.rockenhausen@bbs-donnersberg","ö","Berufsbildende Schule","Donnersbergkreis"]
[60316,"BBS Germersheim","Paradeplatz 8",76726,"Germersheim","(07274)7002-0","sek-germersheim@bbs-germersheim.de","ö","Berufsbildende Schule","Germersheim"]
[60329,"BBS Kusel","Am Roßberg 1",66869,"Kusel","(06381)9242-0","info@bbs-kusel.de","ö","Berufsbildende Schule","Schulzentrum Kusel"]
[60346,"BBS Bingen","Pennrichstr. 9",55411,"Bingen am Rhein","(06721)131-55","mail@bbs-bingen.de","ö","Berufsbildende Schule Bingen"]
[60359,"BBS Ingelheim","Wilhelm-Leuschner-Str. 25",55218,"Ingelheim am Rhein","(06132)71960","info@bbs-ingelheim.de","ö","Berufsbildende Schule","Ingelheim"]
[60362,"BBS Rodalben","Gabelsbergerstr. 6",66976,"Rodalben","(06331)258525","info@bbs-rodalben.de","ö","Berufsbildende Schule Rodalben"]
[60389,"BBS Mainz Maria Ward","Ballplatz 3",55116,"Mainz","(06131)260122","mws@mws-mainz.de","p","Maria Ward-Schule","Berufsbildende Schule"]
[60392,"BBS Koblenz Tech.","Beatusstraße 143-147",56073,"Koblenz","(0261)941801","schulleitung@bbs-technik-koblenz.de","ö","Berufsbildende Schule Technik","Carl-Benz-Schule"]
[60419,"BBS Bad Dürkheim","Im Salzbrunnen 7",67098,"Bad Dürkheim","(06322)9518-0","info@bbs-duew.de","ö","Berufsbildende Schule","Bad Dürkheim"]
[60422,"BBS Landstuhl","Vordere Fröhnstraße 6",66849,"Landstuhl","(06371)617130","sekretariat@bbs-landstuhl.de","ö","Berufsbildende Schule","Landstuhl"]
[60436,"BBS Landau Jw St. Josef","Queichheimer Hauptstr. 231",76829,"Landau in der Pfalz","(06341)9841402","berufsschule@jugendwerk-st-josef.de","p","Private Berufsbildende Schule","Jugendwerk St. Josef"]
[60449,"BBS Kaiserslautern Tech.","Kaiserbergring 29",67657,"Kaiserslautern","(0631)3727-0","info@bbs1-kl.de","ö","Berufsbildende Schule I","Technik"]
[60452,"BBS Koblenz Gew/Hsw/Soz","Beatusstraße 143-147",56073,"Koblenz","(0261)9418-131","sekretariat.jws@julius-wegeler-schule.de","ö","Julius-Wegeler-Schule","BBS Gewerbe/Hausw./Sozialwesen"]
[60466,"BBS Kaiserslautern WS","Martin-Luther-Str. 20",67657,"Kaiserslautern","(0631)3649930","sekretariat@bbs2.edukl.net","ö","Berufsbildende Schule II","Wirtschaft und Soziales"]
[60479,"BBS Kaiserslautern Meister","Am Turnerheim 1",67657,"Kaiserslautern","(0631)3647-403","cwitzke@mhk.bv-pfalz.de","ö","Berufsbildende Schule","Meisterschule für Handwerker"]
[60512,"BBS Koblenz Dr. Zimmermannsche","Mainzer Straße 50",56068,"Koblenz","(0261)91539-0","sekretariat@zimmermannsche.de","p","Dr. Zimmermannsche","Wirtschaftsschule - BBS"]
[60556,"BBS Trier Marienhaus","Egbertstraße 18",54295,"Trier","(0651)4627120","florian.gabriel@marienhaus.de","p","Fachschule für Altenpflege","der Marienhaus Kliniken GmbH"]
[60569,"BBS Landau Bethesda","Bodelschwinghstr. 27",76829,"Landau in der Pfalz","(06341)282-280","Altenpflegeschule-Bethesda@diakonissen.d","p","Private staatlich anerkannte","Fachschule für Altenpflege"]
[60585,"BBS Bad Kreuznach Diakonie","Ringstraße 65",55543,"Bad Kreuznach","(0671)6053294","fs@kreuznacherdiakonie.de","p","Priv. BBS Kreuznacher Diakonie","Fachschule für Sozialwesen"]
[60602,"BBS Speyer Diakonissen","Hilgardstr. 26",67346,"Speyer","(06232)221337","fachschule@diakonissen-speyer.de","p","Diakonissen Fachschule für","Sozialwesen"]
[60662,"BBS Saarburg","Boorwiese 11",54439,"Saarburg","(06581)9140-50","sekretariat@bbs-saarburg.de","ö","Geschwister-Scholl-Schule","Berufsbildende Schule"]
[60675,"BBS Mainz I","Am Judensand 12",55122,"Mainz","0613190603-0","sekretariat@bbs1-mainz.de","ö","Berufsbildende Schule I","Gewerbe und Technik"]
[60689,"BBS Idar-Oberstein","Vollmersbachstraße 53",55743,"Idar-Oberstein","Abt.T:06781962-0","info@bbs-io.de","ö","BBS Idar-Oberstein","Harald-Fissler-Schule"]
[60692,"BBS Neuwied Gew./Tech.","Langendorfer Str. 65",56564,"Neuwied","(02631)98900","info@drsneuwied.de","ö","Berufsbildende Schule Gewerbe","und Technik"]
[60719,"BBS Trier Gest./Tech.","Langstraße 15",54290,"Trier","(0651)7181719","info@bbsgut-trier.de","ö","Berufsbildende Schule","Gestaltung und Technik"]
[60722,"BBS Ludwigshafen Nat","Franz-Zang-Str. 3-7",67059,"Ludwigshafen am Rhein","(0621)504/4171","schule@n.bbslu.de","ö","BBS Naturwissenschaften im","Georg-Kerschensteiner BBZ"]
[60749,"BBS Bad Kreuznach TGHS","Ringstraße 49",55543,"Bad Kreuznach","(0671)887770","info@bbstghs.de","ö","Berufsbildende Schule Technik-","Gewerbe-Hauswirtsch.-Sozialw."]
[60752,"BBS Worms KHSW","Von-Steuben-Str. 31",67549,"Worms","06241853-4300","khsw@biz-worms.de","ö","Karl-Hofmann-Schule"]
[60782,"BBS Mainz II","Feldbergplatz 4",55118,"Mainz","(06131)62778-0","schule.bbs2@stadt.mainz.de","ö","Sophie-Scholl-Schule","BBS II - Hausw./Sozialwesen"]
[60809,"BBS Ludwigshafen SGH","Pfalzgrafenstr. 3",67061,"Ludwigshafen am Rhein","(0621)504-400110","postmaster@sozhw-bbslu.de","ö","Anna-Freud-Schule","BBS SGH"]
[60826,"BBS Trier Ern/Hsw/Soz","Deutschherrenstr. 31",54290,"Trier","(0651)718-3719","sekretariat@bbs-ehs-trier.de","ö","Berufsbildende Schule","Ernährung - Hausw. - Sozialpfl"]
[60902,"BBS Trier St. Helena","Dominikanerstr. 3",54290,"Trier","(0651)41373","sekretariat@bbs-helena-trier.de","p","St. Helena Schule Trier","BBS des Bistums Trier"]
[60916,"BBS Trier Eberhard","Balduinstr. 8",54290,"Trier","(0651)73485","info@privatschule-eberhard.de","p","Kaufmännische Privatschule","Eberhard - BBS"]
[60929,"BBS Worms Wirtschaft","Von-Steuben-Straße 31",67549,"Worms","(06241)8534370","schule@bbsw.biz-worms.de","ö","Berufsbildende Schule","Wirtschaft"]
[60932,"BBS Trier Wirt.","Irminenfreihof 9",54290,"Trier","(0651)718-2719","sekretariat@bbsw-trier.de","ö","Berufsbildende Schule","Wirtschaft"]
[60945,"BBS Mainz III","Am Judensand 8",55122,"Mainz","0613190607-0","bbs3@bbs3-mz.de","ö","Berufsbildende Schule","III Mainz"]
[60959,"BBS Koblenz Wirt.","Cusanusstraße 25",56073,"Koblenz","0261-404070","sekretariat@bbsw-koblenz.de","ö","Berufsbildende Schule","Wirtschaft"]
[60962,"BBS Bad Kreuznach Wirt.","Rheingrafenstraße 20",55543,"Bad Kreuznach","(0671)794973-0","info@bbswkh.de","ö","Berufsbildende Schule","Wirtschaft"]
[62028,"BBS Landstuhl Haus Nazareth","Luitpoldstraße 15",66849,"Landstuhl","(06371)932162","schule-haus-nazareth@bvw-stiftung.de","p","Haus Nazareth","Priv. Berufsbildende Schule"]
[62088,"BBS Bingen Hildegardis","Holzhauserstraße 16",55411,"Bingen am Rhein","(06721)917042","bbs.sekretariat@hildegardisschule.org","ö","Hildegardisschule","Berufsbildende Schule"]
[62135,"BBS Landau Dr. Künkele","Königstraße 18",76829,"Landau in der Pfalz","(06341)92480","ntk@localhost","p","Naturwissenschaftliches","Technikum Dr. Künkele - BBS"]
[62181,"BBS Welschbillig","Puricellistraße 1",54295,"Welschbillig","(06506)899-0","patrick.settemeyer@helenenberg.de","p","Priv. Berufsbildende Schule","der Salesianer Don Boscos"]
[62255,"BBS Ludwigshafen Dr. Stracke","Kaiser-Wilhelm-Str. 34",67059,"Ludwigshafen am Rhein","(0621)512491","info@phs-lu.de","p","Private Handelsschule","Dr. H. Stracke - BBS"]
[62358,"BBS Neuwied JG H.-H.","Am Königsgericht 17",56566,"Neuwied","(02622)8924220","martin.seul@heinrich-haus.de","p","Private Berufsbildende Schule","BBS Heinrich-Haus"]
[62361,"BBS Ludwigshafen Caritas","Dessauer Straße 59",67063,"Ludwigshafen am Rhein",null,null,"p","Private Fachschule Altenpflege","BBS - Caritasv. Diözese Speyer"]
[62481,"BBS Koblenz Hil. von Bingen","Friedrichstr. 3",56068,"Koblenz","(0261)18410","sekretariat-hildegard-von-bingen-schule@","p","Hildegard-von-Bingen-Schule","Priv.FS für Sozialwesen - BBS"]
[62508,"BBS Birkenfeld El-Stift T","Trierer Str. 16-20",55765,"Birkenfeld","(06782)181500","sekretariat@el-stift.de","p","Priv. Fachschule Technik","Berufsbildende Schule"]
[62555,"BBS Neuwied Wirt.","Beverwijker Ring 3",56564,"Neuwied","(02631)96450","sekretariat@les-neuwied.de","ö","Ludwig-Erhard-Schule","BBS Wirtschaft"]
[62781,"BBS Höhr-Grenzhausen","Am Scheidberg 6",56203,"Höhr-Grenzhausen","(02624)94070","schulleitung@fs-keramik.de","ö","Berufsbildende Schule","Fachschule Keramik"]
[62808,"BBS Trier Balthasar-Neumann-Technikum","Paulinstr. 105",54292,"Trier","(0651)91800-0","fs-verwaltung@bnt-trier.com","ö","Balthasar-Neumann-Technikum","Berufsbildende Schule"]
[62811,"BBS Mainz IV","Hechtsheimer Str. 31",55131,"Mainz","(06131)953030","gsw@gsw-mainz.de","ö","Gustav-Stresemann-Wirtschafts-","schule BBS Mainz IV"]
[62958,"BBS Andernach","Schillerring 5 - 7",56626,"Andernach","(02632)251660","info@august-horch-schule.de","ö","Berufsbildende Schule","Andernach"]
[63052,"BBS Mainz Steinhöfel","Rheinallee 3",55116,"Mainz","(06131)9120-0","info@steinhoefelschule.de","p","Steinhöfelschule gGmbH"]
[63588,"BBS Ludwigshafen W1","Mundenheimer Straße 220",67061,"Ludwigshafen am Rhein","(0621)504-400710","sekretariat@bbsw1-lu.de","ö","Berufsbildende Schule","Wirtschaft I"]
[63592,"BBS Ludwigshafen W2","Bismarckstr. 39",67059,"Ludwigshafen am Rhein","(0621)504-400910","info@bbsw2-lu.de","ö","Berufsbildende Schule","Wirtschaft II"]
[63605,"BBS Ludwigshafen T1","Franz-Zang-Str. 3-7",67059,"Ludwigshafen am Rhein","(0621)504-4101","sekretariat@t1.bbslu.de","ö","Berufsbildende Schule","Technik I"]
[63619,"BBS Ludwigshafen T2","Franz-Zang-Str. 3-7",67059,"Ludwigshafen am Rhein","(0621)504/4142","sekretariat@t2.bbslu.de","ö","Berufsbildende Schule","Technik II"]
[63678,"BBS Bad Bergzabern SÜW","Steinfelder Straße 53",76887,"Bad Bergzabern","(06343)935000","bad-bergzabern@bbs-suew.de","ö","Berufsbildende Schule","Südliche Weinstraße"]
[63682,"BBS Birkenfeld El-Stift AP","Trierer Str. 16-20",55765,"Birkenfeld","(06782)181575","c.tholey-martens@el-stift.de","p","Priv. Fachschule für Familien-","und Altenpflege  - BBS"]
[63755,"BBS Betzdorf-Kirchen","Auf dem Molzberg 14",57548,"Kirchen","(02741)95970","verwaltung@bbs-betzdorf-kirchen.de","ö","Berufsbildende Schule","Betzdorf-Kirchen"]
[64150,"BBS Worms DRK BBW","Eckenbertstr. 60",67549,"Worms","(06241)953-151","g.friedrich@bbw-worms.drk.de","p","Berufsschule im","DRK-Berufsbildungswerk"]
[64627,"BBS Daun Maria Hilf","Maria-Hilf-Straße 2",54550,"Daun","(06592)7152366","pflegeschulen.daun@gmx.de","p","Private Fachschule für","Altenpflege - BBS"]
[64643,"BBS Alzey DRK","Kreuznacher Straße 7-9",55232,"Alzey","06731-47190-0","sekretariat@bbs.drk-rlp.de","p","Private Berufsbildende Schule","des DRK LV RLP e.V."]
[64660,"BBS Bitburg Euro-BW","Henry-Dunant Str. 1",54634,"Bitburg","(06561)9453200","Info@localhost","p","Europ. Berufsbildungswerk"]
[64687,"BBS Koblenz Ludwig Fresenius","Bahnhofsweg 6",56073,"Koblenz","0261-47047","koblenz@ludwig-fresenius.de","p","Ludwig Fresenius","Schulen Koblenz"]
[64703,"BBS Trier CEB","Metternichstr. 42",54296,"Trier","(0651)4627910","Anne.Heinen@ceb-akademie.de","p","CEB Pflegeschule"]
[64747,"BBS Mainz Katholisch","Stefanstraße 2-4",55116,"Mainz","061311440780(Ket","info@kbs-mainz.de","p","Katholische Berufsbildende","Schule Mainz"]
[64750,"BBS Bitburg Altenpflegeschule","Maria-Kundenreich-Straße 3",54634,"Bitburg","06561/69487-0","schule-bitburg@schwesternverband.de","p","Altenpflegeschule Bitburg","Berufsbildende Schule"]
[65231,"BBS Landstuhl Bischof-von-Weis","Luitpoldstraße 15 & 28",66849,"Landstuhl",null,null,"p","Bischof-von-Weis-Schule","Private Berufsbildende Schule"]
[70005,"IGS Kaiserslautern B. v. Suttner","Im Stadtwald 1",67663,"Kaiserslautern","(0631)3651430","info@von-suttner-igs.de","ö","Bertha-von-Suttner-Schule","Integrierte Gesamtschule"]
[70018,"IGS Kastellaun","Albert-Schweitzer-Straße",56288,"Kastellaun","(06762)93360","igs@igs-kastellaun.de","ö","Integrierte Gesamtschule","Kastellaun"]
[70021,"IGS Ludwigshafen Ernst Bloch","Hermann-Hesse-Str. 11",67071,"Ludwigshafen am Rhein","(0621)504432110","info@igs-ernstbloch.de","ö","Integrierte Gesamtschule","Ernst Bloch"]
[70035,"IGS Mainz Bretzenheim","Hans-Böckler-Str. 2",55128,"Mainz","(06131)99310","info@igsmz.net","ö","Integrierte Gesamtschule","Bretzenheim"]
[70048,"IGS Ingelheim","Albrecht-Dürer-Str. 30",55218,"Ingelheim am Rhein","(06132)99510","info@igs-ingelheim.de","ö","Integrierte Gesamtschule","Kurt Schumacher"]
[70051,"IGS Mutterstadt","Stuhlbruderhofstraße 12",67112,"Mutterstadt","(06234)94620","verwaltung@igs-mutterstadt.de","ö","Integrierte Gesamtschule","Mutterstadt"]
[70065,"IGS Wörrstadt","Humboldtstr. 1",55286,"Wörrstadt","(06732)91740","info@gfg-woerrstadt.de","ö","Georg-Forster-","Gesamtschule Wörrstadt"]
[70078,"IGS Enkenbach-Alsenborn","Am Mühlberg 23",67677,"Enkenbach-Alsenborn","(06303)92140","info@igsea.bildung-rp.de","ö","Integrierte Gesamtschule","Enkenbach-Alsenborn"]
[70081,"IGS Otterberg","Schulstraße 2",67697,"Otterberg","(06301)71250","info@BvonA-IGS-Otterberg.de","ö","Bettina von Arnim -","IGS-Otterberg"]
[70095,"IGS Kandel","Jahnstr. 20",76870,"Kandel","(07275)98580","sekretariat@igs-kandel.de","ö","Integrierte Gesamtschule","Kandel"]
[70108,"IGS Kaiserslautern Goethe","Goethestr. 35",67655,"Kaiserslautern","0631414703-0","info@goetheschulekl.de","ö","Goetheschule","Integrierte Gesamtschule"]
[70112,"IGS Horhausen","Neue Schulstraße 24",56593,"Horhausen","(02687)920920","info@igs-horhausen.de","ö","Integrierte Gesamtschule","Horhausen"]
[70125,"IGS Hamm","Martin-Luther-Straße 2",57577,"Hamm","(02682)953560","info@igs-hamm-sieg.de","ö","Friedrich-W.-Raiffeisen-Schule","Integrierte Gesamtschule"]
[70138,"IGS Koblenz","Johannesstr. 58-60",56070,"Koblenz","0261-983363-0","info@igs-koblenz.net","ö","Integrierte Gesamtschule","Koblenz"]
[70141,"IGS Rockenhausen","Mühlackerweg 25",67806,"Rockenhausen","(06361)921320","sekretariat@igs-rockenhausen.bildung-rp.","ö","Integrierte Gesamtschule","Rockenhausen"]
[70155,"IGS Stromberg","Rother Weg 19",55442,"Stromberg","067246027-0","info@igs-stromberg.de","ö","Integrierte Gesamtschule","Stromberg"]
[70168,"IGS Ludwigshafen Gartenstadt","Abteistr. 18",67067,"Ludwigshafen am Rhein","0621/5044251-10/","sekretariat@igsluga.de","ö","Integrierte Gesamtschule","Gartenstadt"]
[70171,"IGS Thaleischweiler-Fröschen","Schulstraße 2",66987,"Thaleischweiler-Fröschen",633492230,"sekretariat@igstf.de","ö","Integrierte Gesamtschule","Thaleischweiler-Fröschen"]
[70185,"IGS Mainz Anna Seghers","Geschwister-Scholl-Str. 7",55131,"Mainz","06131-95240-0","info@igsas.de","ö","IGS Anna Seghers","Integrierte Gesamtschule"]
[70198,"IGS Nieder-Olm","Karl-Sieben-Straße 33",55268,"Nieder-Olm","06136-952810","info@igsno.de","ö","Integrierte Gesamtschule"]
[70202,"IGS Sprendlingen","Am Weiher 1",55576,"Sprendlingen","(06701)20581-0","kontakt@igs-gerhard-ertl.de","ö","IGS Gerhard Ertl"]
[70215,"IGS Worms","Neubachstraße 57",67551,"Worms","06241-8534800","sekretariat@nelly-sachs-igs.de","ö","Nelly-Sachs-IGS"]
[70228,"IGS Deidesheim-Wachenheim","Bürgerm.-Oberhettinger-Str. 1",67146,"Deidesheim","0632627897-0","Sekretariat.Deidesheim@igs-dei-wa.de","ö","Integrierte Gesamtschule"]
[70231,"IGS Zell","Am Schulzentrum 1",56856,"Zell","(06542)9897-30","info@igszell.de","ö","Integrierte Gesamtschule Zell"]
[70245,"IGS Landau Montessori","Dörrenbergstr. 1",76829,"Landau in der Pfalz","(06341)945481","sekretariat@montessori-landau.de","p","Freie Montessori Schule","Integrierte Gesamtschule"]
[70258,"IGS Morbach","Klosterweg 7",54497,"Morbach","(06533)95697-0","verwaltung@igs-morbach.de","ö","Integrierte Gesamtschule","Morbach"]
[70261,"IGS Polch","Dechant-Riegel-Straße 27",56751,"Polch","(02654)93730","info@igs-maifeld.de","ö","Integrierte Gesamtschule","Maifeld"]
[70275,"IGS Nastätten","Pestalozzistraße 2",56355,"Nastätten","(06772)93050","verwaltung@igs-nastaetten.de","ö","Integrierte Gesamtschule","Nastätten"]
[70288,"IGS Emmelshausen","Rhein-Mosel-Str. 87",56281,"Emmelshausen","(06747)931232","mail@igs-emmelshausen.de","ö","Integrierte Gesamtschule","Emmelshausen"]
[70291,"IGS Osthofen","Heinrich-Heine-Straße 9-11",67574,"Osthofen","(06242)913240","info@igs-osthofen.de","ö","Integrierte Gesamtschule","Osthofen"]
[70305,"IGS Landstuhl","Konrad-Adenauer-Straße 10",66849,"Landstuhl","(06371)3533","sekretariat@igs-landstuhl.de","ö","Integrierte Gesamtschule","Am Nanstein Landstuhl"]
[70318,"IGS Waldfischbach-Burgalben","Karl-Stöß-Ring 2a",67714,"Waldfischbach-Burgalben","(06333)92020","info@daniel-theysohn-igs.de","ö","Daniel Theysohn IGS","Waldfischbach-Burgalben"]
[70321,"IGS Contwig","Oberauerbacher Str. 53",66497,"Contwig","06332/996077","info@igs-contwig.de","ö","Integrierte Gesamtschule","Contwig"]
[70335,"IGS Rheinzabern","Jockgrimer Straße 100",76764,"Rheinzabern","(07271)9587-0","info@igs-rheinzabern.de","ö","Integrierte Gesamtschule","Rheinzabern"]
[70348,"IGS Rülzheim","Schulstr. 17",76761,"Rülzheim","(07272)92974-0","sekretariat@igs-ruelzheim.de","ö","Integrierte Gesamtschule","Rülzheim"]
[70351,"IGS Mainz Hechtsheim","Ringstr. 41b",55129,"Mainz",613112175200,"schule.igsacmh@stadt.mainz.de","ö","IGS Auguste Cornelius","Mainz-Hechtsheim"]
[70365,"IGS Eisenberg","Friedrich-Ebert-Straße 19",67304,"Eisenberg","(06351)126040","info@igs-eisenberg.de","ö","Integrierte Gesamtschule","Eisenberg"]
[70378,"IGS Landau-Queichheim","Schneiderstraße 69",76829,"Landau in der Pfalz","(06341)134550","igs@landau.de","ö","Integrierte Gesamtschule","Landau"]
[70381,"IGS Grünstadt","Pfortmüllerstr. 33",67269,"Grünstadt","(06359)80880","info@igs-gruenstadt.de","ö","Integrierte Gesamtschule","Grünstadt"]
[70395,"IGS Ludwigshafen Edigheim","Mühlaustr. 51",67069,"Ludwigshafen am Rhein","0621-504425610","info@igs-edigheim.de","ö","Integrierte Gesamtschule","Ludwigshafen Edigheim"]
[70411,"IGS Speyer","Fritz-Ober-Str. 3",67346,"Speyer",6232141500,"sekretariat@igs-speyer.de","ö","Integrierte Gesamtschule","Georg Friedrich Kolb Speyer"]
[70425,"IGS Wörth","Forststraße 1a",76744,"Wörth am Rhein","(07271)949660","info@igs-woerth.de","ö","Carl-Benz-Gesamtschule","Wörth"]
[70438,"IGS Herrstein/Rhaunen","Am Sonnenschlicher 5-7",55624,"Rhaunen","(06544)9991141","info@igs-herrstein-rhaunen.de","ö","Magister Laukhard Integrierte","Gesamtschule Herrstein/Rhaunen"]
[70441,"IGS Schönenberg-Kübelberg/Waldmohr","St.-Wendeler-Straße 16",66901,"Schönenberg-Kübelberg","(06373)811010","info@igs-skw.de","ö","Integrierte Gesamtschule","Schönenberg-Kübelberg/Waldmohr"]
[70455,"IGS Trier","Montessoriweg 4",54296,"Trier","(0651)145922-100","info@igs-trier.de","ö","Integrierte Gesamtschule Trier"]
[70471,"IGS Bad Kreuznach","Heidenmauer 16",55543,"Bad Kreuznach",6714835750,"info@igs-sophie-sondhelm.de","ö","Integrierte Gesamtschule","Sophie Sondhelm Bad Kreuznach"]
[70480,"IGS Frankenthal","Ziegelhofweg 16",67227,"Frankenthal","(06233)64819","sekretariat@igs-frankenthal.de","ö","Integrierte Gesamtschule","Frankenthal"]
[70485,"IGS Betzdorf-Kirchen","Kirchener Straße 64",57518,"Betzdorf","02741-93502-0","info@igsgs.bildung-rp.de","ö","Integrierte Gesamtschule","Betzdorf-Kirchen"]
[70498,"IGS Neuwied","Friedrich-Siegert-Str. 3",56564,"Neuwied","(02631)98567-0-H","sekretariat@igsneuwied.de","ö","Integrierte Gesamtschule","Johanna Loewenherz Neuwied"]
[70501,"IGS Plaidt","Wilhelm-Röntgen-Straße 4",56637,"Plaidt","(02632)94784-0","info@igspellenz.de","ö","Integrierte Gesamtschule","Pellenz"]
[70515,"IGS Selters","Jahnstraße 24-28",56242,"Selters","(02626)97840","info@igs-selters.de","ö","Integrierte Gesamtschule","Selters"]
[70528,"IGS Hermeskeil","Schulstraße 48",54411,"Hermeskeil","(06503)9277-0","info@igshk.de","ö","Integrierte Gesamtschule","Hermeskeil"]
[70531,"IGS Oppenheim","Am Stadtbad 20",55276,"Oppenheim","(06133)509060","info@igs-oppenheim.de","ö","Integrierte Gesamtschule","An den Rheinauen"]
[70545,"IGS Salmtal","Salmaue 8",54528,"Salmtal","(06578)985580","info@igs-salmtal.de","ö","Integrierte Gesamtschule","Salmtal"]
[70558,"IGS Remagen","Goethestraße 43-45",53424,"Remagen","02642/4052811-0","info@igs-remagen.de","ö","Integrierte Gesamtschule","Remagen"]
[70561,"IGS Mainz Europakreisel","Hechtsheimer Str. (Geb. 20) 2",55131,"Mainz",613112175300,null,"ö","IGS Mainz","am Europakreisel"]
[79005,"FWS Mainz","Merkurweg 2",55126,"Mainz","(06131)472077","info@fws-mainz.de","p","Freie Waldorfschule Finthen"]
[79018,"FWS Trier","Montessoriweg 7",54296,"Trier","(0651)9930136","info@waldorfschule-trier.de","p","Freie Waldorfschule Trier"]
[79021,"FWS Neuwied","Augustenthaler Straße 25",56567,"Neuwied","(02631)96420","info@waldorfschule-neuwied.de","p","Rudolf-Steiner-Schule Mittel-","rhein - Freie Waldorfschule"]
[79034,"FWS Diez","Wilhelm-von-Nassau-Park 19",65582,"Diez","(06432)80080","info@waldorfschule-diez.de","p","Freie Waldorfschule Diez"]
[79048,"FWS Frankenthal","Julius-Bettinger-Straße 1",67227,"Frankenthal","(06233)60052-0","waldorfschule@fwsft.de","p","Freie Waldorfschule","Frankenthal"]
[79064,"FWS Otterberg","Schulstraße 4",67697,"Otterberg","(06301)793350","info@fws-otterberg.de","p","Freie Waldorfschule","Westpfalz"]
[79078,"FWS Kastellaun","An der Molkerei 15",56288,"Kastellaun","(06762)963851","sekretariat@localhost","p","Freie Waldorfschule Kastellaun"]
[79081,"FWS Neustadt","Konrad-Adenauer-Straße 14-16",67433,"Neustadt","(06321)5790409","info@waldorfschule-neustadt.de","p","Waldorfschule Neustadt","Freie Goetheschule"]
[79108,"FWS Bad Kreuznach","Rheingrafenstraße 155a",55543,"Bad Kreuznach","0671-2154820","info@fwskh.de","p","Freie Waldorfschule","Bad Kreuznach"]
[79111,"FWS Mayen","Magmastraße 1",56727,"Mayen",null,null,"p","Freie Waldorfschule","Mayen"]