{"text_format":"1","workbook":"xlsx","n_sheets":3,"sheets":["Antrag","Tabelle2","Schulliste 11.23"],"not_rendered":{"charts":0,"images":1,"macros":1,"external_links":0,"defined_names":2,"comments":0,"pivot_tables":0},"unopened":[],"bounds":{"document_bytes":16777216,"sheet_cells":100000,"rows_first":2000,"rows_last":500,"rows_between":2000,"halvings":0,"cell_chars":16384,"cell_head_chars":4096},"cells_cut":0,"cells_raw":0,"read":"whole","date_system":"1900"}

{"sheet":"Antrag","index":0,"n_rows":26,"n_cols":16,"rows_kept":26,"cut":false,"hidden":false,"merged":[[9,2,9,5],[10,2,10,5],[11,2,11,5],[12,2,12,5],[23,1,23,5],[25,1,25,5],[1,1,1,5],[15,1,18,1],[15,2,15,3],[16,2,16,3],[17,2,17,3],[18,2,18,3],[4,2,4,5],[5,2,5,5],[6,2,6,5],[7,2,7,5],[8,2,8,5],[20,2,20,5],[14,1,14,5],[21,3,21,5],[24,1,24,4]]}
[null,null,null,null,null,"GS Weyerbusch",null,null,"Plausi"]
[null,"Antrag auf Zuweisung einer Fremdsprachenassistenzkraft"]
[null,"für das Schuljahr ",null,"bitte auswählen …",null,null,null,null,{"$f":"IF(D3<>\"\",\"true\",\"false\")","v":"true"}]
[]
[null,"Schulnummer"]
[null,"Schulname",{"$f":"IFERROR(VLOOKUP(C5,'Schulliste 11.23'!$A$3:$G$1592,2,FALSE),\"\")","v":""}]
[null,"Straße, Nummer",{"$f":"IFERROR(VLOOKUP(C5,'Schulliste 11.23'!$A$3:$G$1592,3,FALSE),\"\")","v":""}]
[null,"PLZ",{"$f":"IFERROR(VLOOKUP(C5,'Schulliste 11.23'!$A$3:$G$1592,4,FALSE),\"\")","v":""}]
[null,"Ort",{"$f":"IFERROR(VLOOKUP(C5,'Schulliste 11.23'!$A$3:$G$1592,5,FALSE),\"\")","v":""}]
[null,"Telefon",{"$f":"IFERROR(VLOOKUP(C5,'Schulliste 11.23'!$A$3:$G$1592,6,FALSE),\"\")","v":""}]
[null,"E-Mail Schule",{"$f":"IFERROR(VLOOKUP(C5,'Schulliste 11.23'!$A$3:$G$1592,7,FALSE),\"\")","v":""}]
[null,"Kontaktperson/en",null,null,null,null,null,null,{"$f":"IF(C12<>\"\",\"true\",\"false\")","v":"false"}]
[null,"Email Kontaktperson/en",null,null,null,null,null,null,{"$f":"IF(C13<>\"\",\"true\",\"false\")","v":"false"}]
[]
[null,"Hiermit beantragen wir die Zuweisung einer Fremdsprachenassistenzkraft für das Fach: ",null,null,null,null,null,null,null,null,null,null,null,null,null,"rř"]
[null,"Bitte die \ngewünschte \nPriorität eingeben",null,null,"Englisch",null,null,null,{"$f":"IF(OR(C16<>\"Wählen Sie ein Element aus …\",C17<>\"Wählen Sie ein Element aus …\",C18<>\"Wählen Sie ein Element aus …\",C19<>\"Wählen Sie ein Element aus …\"),\"true\",\"false\")","v":"true"}]
[null,null,null,null,"Französisch"]
[null,null,null,null,"Spanisch"]
[null,null,null,null,"Italienisch"]
[null,"Bilingualer Zweig",null,"Englisch",null,"Französisch",null,null,"true"]
[null,"Bemerkungen\n(bitte ausfüllen)",null,null,null,null,null,null,{"$f":"IF(C21<>\"\",\"true\",\"false\")","v":"false"}]
[null,"Zustimmung",null,"Die Schulleitung hat dem Antrag auf Zuweisung einer FSA zugestimmt.",null,null,null,null,{"$f":"IF(C22=\"x\",\"true\",\"false\")","v":"false"}]
[null,{"$f":"IF(OR(I22=\"\",AND(I22=\"true\",I21=\"true\",I20=\"true\",I16=\"true\",I13=\"true\",I12=\"true\",I3=\"true\")),\"Daten vollständig\",\"Daten fehlen\")","v":"Daten fehlen"}]
[null,"Den Antrag bitte bis spätestens 31. Januar über den Button „Absenden“ abschließen."]
[]
[null,"Es wird automatisch eine Mail hierzu generiert. Warten Sie bitte, bis sich Outlook öffnet!"]

{"sheet":"Tabelle2","index":1,"n_rows":7,"n_cols":6,"rows_kept":7,"cut":false,"hidden":true,"merged":[]}
["Schuljahre",null,null,null,null,"GS Trier Ausonius"]
["bitte auswählen …"]
["2023/24",null,1]
["2024/25",null,2]
["2025/26",null,3]
["2026/27",null,4]
[null,null,"nein"]

{"sheet":"Schulliste 11.23","index":2,"n_rows":1592,"n_cols":10,"rows_kept":1592,"cut":false,"hidden":true,"merged":[]}
["SCHNR","KURZB","STRASSE","PLZ","ORT","TELEFON","EMAIL","ö/p","ADR1","ADR2"]
["bitte Schulnummer eintragen …"]
[10058,"GS Trier Ambrosius","Hans-Eiden-Platz 2",54292,"Trier","(0651)46394210","gs-ambrosius@arcor.de","ö","Ambrosius-Grundschule"]
[10075,"GS Trier Ausonius","Langstraße 4",54290,"Trier","(0651)718-4000","info@ausonius-grundschule.de","ö","Ausonius-Grundschule"]
[10091,"GS Linz","Schulstraße 10",53545,"Linz am Rhein","(02644)96000","sekretariat@grundschule-linz.de","ö","Bürgerm.-Castenholtz-Schule","Grundschule Linz"]
[10105,"GS Weyerbusch","Bgm.-Raiffeisen-Schule 11",57635,"Weyerbusch","(02686)295","grundschule@gs-weyerbusch.de","ö","Bürgerm.-Raiffeisen-Schule","Grundschule"]
[10118,"GS Frankenthal Carl-Bosch","Carl-Bosch-Ring 29",67227,"Frankenthal","(06233)26530","verwaltung@cbs-ft.bildung-rp.de","ö","Grundschule Carl Bosch"]
[10135,"GS Nackenheim","Pommardstraße 15",55299,"Nackenheim","(06135)9296.0","grundschule-nackenheim@vg-bodenheim.de","ö","Carl-Zuckmayer-Grundschule"]
[10148,"GS Mainz-Lerchenberg","Hindemithstr. 1",55127,"Mainz","(06131)364660","schule.gs-lerchenberg@stadt.mainz.de","ö","Grundschule Lerchenberg"]
[10181,"GS Weingarten","Schulstr. 12",67366,"Weingarten","(06344)2538","kontakt@grundschule-weingarten.de","ö","Ritter-von-Weingarten-Schule","Grundschule"]
[10238,"GS Worms Diesterweg","Nievergoltstr. 63",67549,"Worms","(06241)76044","diesterweg-gs@worms.de","ö","Diesterwegschule","Grundschule"]
[10255,"GS Newel","Trierer Straße 30",54309,"Newel","(06505)1743","gs-butzweiler@online.de","ö","Grundschule Aach-Newel"]
[10268,"GS Limburgerhof Domholz","Hermann-Löns-Weg 21",67117,"Limburgerhof","(06236)465552","domholzschule@gmx.de","ö","Grundschule Domholz"]
[10285,"GS Niederkirchen/Deidesheim","Im Kirchgarten 23",67150,"Niederkirchen","(06326)1377","sekretariat@don-bosco-schule-niederkirch","ö","Grundschule Niederkirchen"]
[10298,"GS Neustadt Albert-Finck","Horstweg 21",67434,"Neustadt","(06321)84795","gs-albert-finck@schulen.neustadt.eu","ö","Dr.-Albert-Finck-Schule","Grundschule"]
[10301,"GS Trier Egbert","Soterstraße 3",54295,"Trier","(0651)49251","post@egbert-grundschule.de","ö","Egbert-Grundschule"]
[10315,"GS Neustadt Eichendorff","Spitalbachstr. 45",67433,"Neustadt","(06321)186675","gs-eichendorff@schulen.neustadt.eu","ö","Eichendorff-Schule","Grundschule"]
[10328,"GS Bad Ems Ernst-Born","Arzbacher Str. 68",56130,"Bad Ems","(02603)12410","Ernst-Born-Schule@vgben.de","ö","Ernst-Born-Schule","Grundschule"]
[10331,"GS Haßloch Ernst-Reuter","Martin-Luther-Str. 25",67454,"Haßloch","(06324)935130","ernst-reuter-schule@hassloch.de","ö","Ernst-Reuter-Schule","Grundschule"]
[10388,"GS Bad Ems Freiherr-vom-Stein","Karl-Busch-Str. 1",56130,"Bad Ems","(02603)919510","Stein-Schule-Bad-Ems@gmx.de","ö","Grundschule Freiherr-vom-Stein"]
[10405,"GS Frankenthal Friedrich-Ebert","Jakobsplatz 3",67227,"Frankenthal","(06233)43099","gs-fes-frankenthal@gmx.de","ö","Friedrich-Ebert-Grundschule"]
[10421,"GS Trier Barbara","Friedrich-Wilhelm-Str. 52",54290,"Trier","(0651)49252","barbara-grundschule@web.de","ö","Barbara-Grundschule"]
[10435,"GS Hamm","Martin-Luther-Str. 4",57577,"Hamm","(02682)969422","gshamm@grundschule-hamm.de","ö","Friedrich-W.-Raiffeisen-Schule","Grundschule"]
[10451,"GS Gensingen","Schulstr. 4",55457,"Gensingen","(06727)8627","info@gsgensingen.de","ö","Grundschule Gensingen"]
[10465,"GS Neidenfels","Schulstraße 1",67468,"Neidenfels","(06325)8376","GGS.Neidenfels@t-online.de","ö","Gemeinsame Grundschule","Neidenfels und Frankeneck"]
[10478,"GS Ottersheim","Schulstraße 2",76879,"Ottersheim","(06348)7662","gsottersheim@gmail.com","ö","Grundschule","Ottersheim - Knittelsheim"]
[10481,"GS Sprendlingen","Schulstraße 44",55576,"Sprendlingen","(06701)1367","mail@grundschulesprendlingen.de","ö","Grundschule Sprendlingen"]
[10494,"GS Undenheim","Staatsrat-Schwamb-Straße 107",55278,"Undenheim","(06737)9627","info@grundschule-undenheim.de","ö","Grundschule","Am Goldbach"]
[10555,"GS Ilbesheim","Arzheimer Straße 75",76831,"Ilbesheim","(06341)32852","info@gs-ilbesheim.de","ö","Grundschule Kleine Kalmit"]
[10615,"GS Ingelheim Heidesheim","Kreuzstraße 47",55262,"Ingelheim am Rhein","(06132)50990","gs-heidesheim@ingelheim.de","ö","Grundschule an der Sandmühle","Heidesheim"]
[10631,"GS Ingelheim Pestalozzi","Carolinenstraße 7",55218,"Ingelheim am Rhein","(06132)73318","pestalozzischule@ingelheim.de","ö","Pestalozzi-Schule","Grundschule"]
[10645,"GS Lambsheim","Neustadter Straße 23",67245,"Lambsheim","(06233)346890","grundschule@karlwendelschule.de","ö","Karl-Wendel-Schule","Grundschule"]
[10658,"GS Maikammer","Schulstr. 3 - 5",67487,"Maikammer","(06321)952749","jls-maikammer@gmx.de","ö","Johannes-Leonhardt-Schule","Grundschule"]
[10718,"GS Waldsee","Schifferstadter Straße 2",67165,"Waldsee","(06236)54127","hgswaldsee@gmx.de","ö","Hermann-Gmeiner-Schule","Grundschule"]
[10764,"GS Neustadt August-Becker","Pestalozzistr. 4",67435,"Neustadt","(06327)3196","gs-august-becker@schulen.neustadt.eu","ö","August-Becker-Schule","Grundschule"]
[10794,"GS Mainz Ludwig-Schwamb","Schillstraße 4",55131,"Mainz","(06131)574862","schule.gs-ludwig-schwamb@stadt.mainz.de","ö","Ludwig-Schwamb-Schule","Grundschule"]
[10808,"GS Frankenthal Neumayer","Neumayerring 7",67227,"Frankenthal","(06233)298080","schulleiter@neumayer-grundschule.de","ö","Neumayer-Grundschule"]
[10825,"GS Idar-Oberstein Algenrodt","Weihergasse 20",55743,"Idar-Oberstein","(06781)64750","gs-algenrodt@idar-oberstein.de","ö","Grundschule","Algenrodt"]
[10838,"GS Braubach","Stiftstr. 1",56338,"Braubach","(02627)532","marksburgschule@t-online.de","ö","Marksburgschule","Grundschule"]
[10841,"GS Daleiden","Hauptstraße 5",54689,"Daleiden","(06550)746","info@gs-daleiden.de","ö","Pfarrer-Michael-Bormann-","Grundschule"]
[10868,"GS Dierdorf Gutenberg","Schulstraße 20",56269,"Dierdorf","(02689)3044","info@gbs-dierdorf.de","ö","Gutenberg-Schule","Grundschule"]
[10871,"GS Ediger-Eller","Paulusstr. 48",56814,"Ediger-Eller","(02675)343","gs-ediger-eller@gs-ediger-eller.bildung-","ö","Grundschule","Ediger-Eller"]
[10898,"GS Flomborn","Schulstraße 14",55234,"Flomborn","(06735)411","info@grundschule-flomborn.de","ö","Grundschule Flomborn"]
[10901,"GS Flonheim","Bahnhofstr. 5",55237,"Flonheim","(06734)91304-130","info@grundschule-flonheim.de","ö","Grundschule Flonheim"]
[10928,"GS Freudenburg","Leukstraße 18",54450,"Freudenburg","(06582)330","info@grundschule-freudenburg.de","ö","Grundschule Freudenburg"]
[10931,"GS Gau-Odernheim","Freiherr-vom-Stein-Str. 49",55239,"Gau-Odernheim","(06733)929676","info@gs-go.de","ö","Grundschule Gau-Odernheim"]
[10958,"GS Hagenbach","Am Stadtrand 1",76767,"Hagenbach","(07273)2520","hagenbach@gs.vg-hagenbach.de","ö","Hainbuchenschule","Grundschule"]
[10961,"GS Holzappel","Schulstraße 4",56379,"Holzappel","(06439)271","esterauschule@gmx.de","ö","Esterauschule","Grundschule"]
[10991,"GS Mainz Theodor-Heuss","Ringstraße 41b",55129,"Mainz","(06131)592056","schule.gs-hechtsheim@stadt.mainz.de","ö","Theodor-Heuss-Schule","Grundschule Mainz-Hechtsheim"]
[11019,"GS Münstermaifeld","Cusanusstr. 1",56294,"Münstermaifeld","(02605)2044","sekretariat.gs.mm@maifeld.de","ö","Cusanusschule"]
[11035,"GS Neustadt Mussbach","Schulstr. 12",67435,"Neustadt","(06321)69529","gs-mussbach@schulen.neustadt.eu","ö","Grundschule Mussbach"]
[11049,"GS Niederbrombach","Hauptstr. 2",55767,"Niederbrombach","(06787)981200","ghsniederbrombach@freenet.de","ö","Grundschule Niederbrombach"]
[11065,"GS Ochtendung","Raiffeisenplatz 5",56299,"Ochtendung","(02625)960156","gs.stmartin.oc@maifeld.de","ö","Grund- und Ganztagsschule","St.Martin"]
[11095,"GS Schönecken","An der Schule 1",54614,"Schönecken","(06553)92620","GHS-Schoenecken@t-online.de","ö","Graf-Hartard-Grundschule"]
[11112,"GS Neustadt Schöntal","Sauterstraße 95",67433,"Neustadt","(06321)487727","gs-schoentalschule@schulen.neustadt.eu","ö","Schöntalschule","Grundschule"]
[11139,"GS Mayen St. Veit","Koblenzer Str. 133",56727,"Mayen","(02651)947718","st.veitschule.my@t-online.de","ö","Grundschule St. Veit"]
[11155,"GS Trier Zewen","Fröbelstraße 7",54294,"Trier","(0651)85776","info@grundschule-zewen.de","ö","Grundschule Trier-Zewen"]
[11172,"GS Baumholder","Im Brühl 7",55774,"Baumholder","(06783)981130","schulleitung@grundschule-westrich-baumho","ö","Grundschule Baumholder","Westrich"]
[11259,"GS Mainz-Mombach-West","Am Lemmchen 48",55120,"Mainz","(06131)968154","schule.gs-amlemmchen@stadt.mainz.de","ö","Grundschule","Mombach-West"]
[11262,"GS Frankenthal Lessing","Gottfried-Keller-Str. 40",67227,"Frankenthal","(06233)64709","gs.lessingschule.ft@web.de","ö","Lessing-Schule","Grundschule"]
[11275,"GS Neustadt Ostschule","Konrad-Adenauer-Straße 33",67433,"Neustadt","(06321)189998-0","gs-ostschule@schulen.neustadt.eu","ö","Ostschule","Grundschule"]
[11289,"GS Neustadt Heinz-Sielmann","Ludwigstr. 30",67433,"Neustadt","(06321)937181","gs-heinz-sielmann-schule@schulen.neustad","ö","Heinz-Sielmann-Schule","Grundschule"]
[11292,"GS Ludwigshafen Blies","Krummlachstraße 10",67059,"Ludwigshafen am Rhein","(0621)504420710","info-gs@bliesschulen.de","ö","Bliesschule","Grundschule"]
[11305,"GS Idar-Oberstein Oberstein","Wüstenfeldstraße 50",55743,"Idar-Oberstein","(06781)64780","gs-oberstein@idar-oberstein.de","ö","Grundschule","Oberstein"]
[11319,"GS Haßloch Schiller","Schillerstr. 1a",67454,"Haßloch","(06324)935152","sonja.kammermayer@hassloch.de","ö","Schillerschule","Grundschule II"]
[11322,"GS Ludwigshafen Grimm","Hornstraße 1",67061,"Ludwigshafen am Rhein","(0621)504420910","info@gs-brueder-grimm.de","ö","Brüder-Grimm-Schule","Grundschule"]
[11335,"GS Mainz Feldberg","Feldbergplatz 4",55118,"Mainz","(06131)679901","schule.feldberg@stadt.mainz.de","ö","Feldbergschule","Grundschule"]
[11349,"GS Neuwied-Oberbieber","Veilchenstraße 5",56566,"Neuwied","(02631)47656","friedrich-ebert-schule@schulen-neuwied.d","ö","Friedrich-Ebert-Schule","Grundschule Oberbieber"]
[11352,"GS Kaiserslautern Geschwister-Scholl","Schreberstr. 37-39",67657,"Kaiserslautern","(0631)46109","gsgs-kl@web.de","ö","Geschwister-Scholl-Schule","Grundschule"]
[11365,"GS Ludwigshafen Goethe Nord","Goethestraße 19",67063,"Ludwigshafen am Rhein","(0621)504421510","info@goetheschule-nord.de","ö","Goetheschule Nord","Grundschule"]
[11379,"GS Mainz Goethe","Scheffelstr. 2",55118,"Mainz","(06131)612026","schule.gs-goethe@stadt.mainz.de","ö","Goetheschule","Grundschule"]
[11382,"GS Ludwigshafen Gräfenau","Gräfenaustraße 32",67063,"Ludwigshafen am Rhein","(0621)504421910","info@gsgraefenau.de","ö","Grundschule Gräfenau"]
[11395,"GS Ludwigshafen Kreuter","Am Brückelgraben 91",67071,"Ludwigshafen am Rhein","(0621)504-4225-1","info@kks-lu.de","ö","Karl-Kreuter-Schule","Grundschule"]
[11412,"GS Kaiserslautern Kotten","Kammgarnstr. 17",67659,"Kaiserslautern","(0631)78147","kottenschule@kaiserslautern.de","ö","Grundschule","Kottenschule"]
[11425,"GS Kaiserslautern Luitpold","Albrechtstr. 3",67655,"Kaiserslautern","(0631)69416","gs.luitpoldschule@kaiserslautern.de","ö","Luitpoldschule","Grundschule"]
[11439,"GS Ludwigshafen Luitpold","Luitpoldstraße 37",67063,"Ludwigshafen am Rhein","(0621)504422910","info@luitpoldschule.de","ö","Luitpold-Schule","Grundschule"]
[11442,"GS Mainz Maler-Becker","Schulstr. 7",55124,"Mainz","(06131)41720","schule.maler-becker@stadt.mainz.de","ö","Maler-Becker-Schule","Grundschule Gonsenheim"]
[11455,"GS Kaiserslautern Pestalozzi","Pfaffenbergstr. 108",67663,"Kaiserslautern","(0631)28637","pestalozzischule@kaiserslautern.de","ö","Pestalozzischule","Grundschule"]
[11469,"GS Ludwigshafen Oppau","Kurt-Schumacher-Straße 38",67069,"Ludwigshafen am Rhein","(0621)504421710","info@GS-Goethe-Mozart.de","ö","Goethe-Mozart-Schule","Grundschule Oppau"]
[11472,"GS Mainz Pestalozzi","Pestalozziplatz 6",55120,"Mainz","(06131)683410","schule.pestalozzi@stadt.mainz.de","ö","Pestalozzi-Schule","Grundschule Mombach"]
[11485,"GS Ingelheim Präsident Mohr","Schulstr. 12-14",55218,"Ingelheim am Rhein","(06132)75050","praesident-mohr-schule@ingelheim.de","ö","Präsident Mohr-Schule","Grundschule"]
[11498,"GS Kaiserslautern Röhm","Moltkestr. 27",67655,"Kaiserslautern","(0631)10833","gs-roehmschule@web.de","ö","Röhmschule","Grundschule"]
[11502,"GS Ludwigshafen Rupprecht","Nietzschestraße 30",67063,"Ludwigshafen am Rhein","(0621)504423710","info@gs-rupprechtschule.de","ö","Rupprechtschule","Grundschule"]
[11515,"GS Höhr-Grenzhausen","Schulstr. 9",56203,"Höhr-Grenzhausen","(02624)4749","goethe-schule@gs-hoehr-g.de","ö","Grundschule Goethe-Schule"]
[11529,"GS Kaiserslautern Schiller","Leipziger Straße 109",67663,"Kaiserslautern","0631-3654920","gs.schillerschule@kaiserslautern.de","ö","Schillerschule","Grundschule"]
[11532,"GS Ludwigshafen Oggersheim","Wormser Straße 17",67071,"Ludwigshafen am Rhein","(0621)504424110","info@gs-schiller.de","ö","Schillerschule 1","Grundschule"]
[11545,"GS Kaiserslautern Stiftswald","Stiftswaldstr. 54",67657,"Kaiserslautern","(0631)470111","gs.stiftswaldschule@kaiserslautern.de","ö","Stiftswaldschule","Grundschule"]
[11559,"GS Kaiserslautern Stresemann","Stresemannstr. 3",67663,"Kaiserslautern","(0631)59382","stresemannschule@kaiserslautern.de","ö","Stresemannschule","Grundschule"]
[11562,"GS Kaiserslautern Theodor-Heuss","Haspelstr. 37 - 39",67657,"Kaiserslautern","(0631)69229","gs-theodor-heuss-kl@gmx.de","ö","Theodor-Heuss-Schule","Grundschule"]
[11575,"GS Ludwigshafen Kästner","Bahnhofstraße 52",67059,"Ludwigshafen am Rhein","(0621)504421110","info@eks-lu.de","ö","Erich-Kästner-Schule","Grundschule"]
[11588,"GS Ludwigshafen Lessing","Bürgermeister-Fries-Straße 1c",67069,"Ludwigshafen am Rhein","(0621)504422710","info@gs-lessingschule.de","ö","Lessingschule","Grundschule"]
[11593,"GS Koblenz-Neuendorf","Handwerkerstraße 12-14",56070,"Koblenz","(0261)869757","schulleitung@gsneuendorf.bildung.koblenz","ö","Willi-Graf-Schule","Grundschule Neuendorf"]
[11605,"GS Ludwigshafen Wittelsbach","Wittelsbachstraße 73",67061,"Ludwigshafen am Rhein","(0621)504424510","info@gs-wittelsbachschule.de","ö","Grundschule Wittelsbach"]
[11619,"GS Mainz Münchfeld","Watfordstr. 30",55122,"Mainz","(06131)324723","schule.muenchfeld@stadt.mainz.de","ö","Grundschule Mainz-","Hartenberg-Münchfeld"]
[11622,"GS Kaiserslautern Betzenberg","Kantstr. 97",67663,"Kaiserslautern","(0631)10835","gs-betzenberg@web.de","ö","Grundschule Betzenberg"]
[11635,"GS Kaiserslautern Auf dem Fischerrück","Stettiner Str. 35",67659,"Kaiserslautern","(0631)3703283","gs.fischerrueck@kaiserslautern.de","ö","Grundschule","Auf dem Fischerrück"]
[11652,"GS Ludwigshafen Langgewann","Adolf-Kolping-Straße 30",67071,"Ludwigshafen am Rhein","(0621)504422310","info@langgewannschule.de","ö","Grundschule In der Langgewann"]
[11678,"GS Wasserliesch","In der Acht 4",54332,"Wasserliesch","(06501)13808","Grundschule-Wasserliesch@Konz.de","ö","Grundschule St. Marien"]
[11683,"GS Gau-Bickelheim","Pestalozzistr. 5",55599,"Gau-Bickelheim","(06701)2892","grundschule@gs-gaubickelheim.de","ö","Grundschule St. Martin"]
[11709,"GS Konz St. Nikolaus","Schlesierstraße 35",54329,"Konz","(06501)5744","GS.St.Nikolaus@Konz.de","ö","Grundschule St. Nikolaus"]
[11725,"GS Adenau","Schulstraße 18",53518,"Adenau","02691-546","info@grundschule-adenau.de","ö","Grundschule Adenau"]
[11739,"GS Ahrbrück","Kesselinger Straße 8",53506,"Ahrbrück","(02643)6774","gs-ahrbrueck@altenahr.de","ö","Denntal Grundschule Ahrbrück"]
[11742,"GS Ludwigshafen Schweitzer","Georg-Herwegh-Straße 9-11",67061,"Ludwigshafen am Rhein","(0621)504420110","sekretariat@asslu.de","ö","Albert-Schweitzer-Schule","Grundschule"]
[11755,"GS Zellertal","Zeller Straße 3",67308,"Zellertal","(06355)953930","gsz@zellertal-schule.de","ö","Zellertal-Schule","Grundschule"]
[11768,"GS Alf","Mühlenstraße 5",56859,"Alf","(06542)22374","schulealf@googlemail.com","ö","Grundschule Alf"]
[11786,"GS Ludwigshafen Delp","Schilfstraße 17",67067,"Ludwigshafen am Rhein","(0621)504420310","info@alfred-delp-gs.de","ö","Alfred-Delp-Schule","Grundschule"]
[11799,"GS Alpenrod","Schulstr. 8",57642,"Alpenrod","(02662)7790","schulleitung@grundschule-alpenrod.de","ö","Grundschule Alpenrod"]
[11802,"GS Alsdorf","Hauptstraße 53",57518,"Alsdorf","(02741)23134","hellertal@gsalsdorf.bildung-rp.de","ö","Grundschule Hellertal"]
[11815,"GS Trier-Heiligkreuz","Rotbachstraße 21",54295,"Trier","(0651)309872","post@grundschule-heiligkreuz.de","ö","Grundschule Heiligkreuz"]
[11829,"GS Rammelsbach","Schulstraße 2",66887,"Rammelsbach","(06381)3259","grundschule-rammelsbach@web.de","ö","Grundschule Rammelsbach"]
[11832,"GS Altenkirchen Pfalz","Schulstr. 12",66903,"Altenkirchen","(06386)6424","sekretariat.gsak@bildung.vgog.de","ö","Grundschule Altenkirchen"]
[11858,"GS Anhausen","Auf dem Löh 5",56584,"Anhausen","(02639)258","info@grundschule-anhausen.de","ö","Braunsburgschule","Grundschule"]
[11863,"GS Antweiler","Eichenbacher Weg 36",53533,"Antweiler","(02693)930016","mva-grundschule@gmx.de","ö","Margaretha-von-Arenberg-Schule","Grundschule"]
[11876,"GS Koblenz-Arenberg","Urbarer Straße 8",56077,"Koblenz","(0261)68367","schule@gsarenberg.bildung-rp.de","ö","Grundschule Arenberg"]
[11889,"GS Argenthal","Aulergasse 25",55496,"Argenthal","06761-1209808","info@grundschule-argenthal.de","ö","Grundschule am Waldsee","Argenthal"]
[11893,"GS Armsheim","Keltenweg 15",55288,"Armsheim","(06734)8728","info@gs-armsheim.de","ö","Wiesbachtalgrundschule"]
[11905,"GS Arzfeld","Schulstraße 10",54687,"Arzfeld","(06550)1275","info@gs-arzfeld.de","ö","Grundschule St. Christophorus"]
[11919,"GS Koblenz-Asterstein","Lehrhohl 42",56077,"Koblenz","(0261)74797","info@gsasterstein.bildung.koblenz.de","ö","Grundschule Asterstein"]
[11922,"GS Atzelgift-Streithausen","Schulstraße 20",57629,"Atzelgift","(02662)1333","GS.Atzelgift-Streithausen@rz-online.de","ö","Grundschule","Atzelgift-Streithausen"]
[11979,"GS Bad Bergzabern","Lessingstr. 38",76887,"Bad Bergzabern","(06343)989620","Sekretariat@boehaemmer-grundschule.de","ö","Böhämmer-Grundschule"]
{"$rows_left_out":1472}